BDBM220410 US9296708, 16
SMILES COc1ccc(NCCOCCOCc2cn(CCCC[C@H](NC(=O)N[C@@H](CCC(O)=O)C(O)=O)C(O)=O)nn2)cc1
InChI Key InChIKey=IAFQMHOXDOGRMS-VXKWHMMOSA-N
Data  1 KI  1 IC50
  Tab Delimited (TSV)   2D SDfile   Computed 3D by Vconf -m prep SDfile
Find this compound or compounds like it in BindingDB:
Activity Spreadsheet -- Enzyme Inhibition Constant Data from BindingDB
Found 1 hit for monomerid = 220410
TargetDiacylglycerol O-acyltransferase 1(Homo sapiens (Human))
Yale University
US Patent
LigandPNGBDBM220410(US9296708, 16)
Affinity DataKi:  0.970nM IC50:  21.9nM. Assay description: For IC50 measurements, inhibitors were dissolved in Reaction Buffer containing 40 μM NAAG to a final volume of 100 μL. Then, 25 μL of this s...
Ligand InfoPC cidPC sid
In DepthDetails US Patent