BDBM225696 GTC000469A
SMILES NC[C@H]1CCC[C@@H](CNc2ccc(cn2)C(N)=O)C1
InChI Key InChIKey=UUTSJGSKPMLQOF-WDEREUQCSA-N
Data  1 IC50
PDB links: 1 PDB ID matches this monomer.
  Tab Delimited (TSV)   2D SDfile   Computed 3D by Vconf -m prep SDfile
Find this compound or compounds like it in BindingDB:
Activity Spreadsheet -- Enzyme Inhibition Constant Data from BindingDB
Found 1 hit for monomerid = 225696
TargettRNA (guanine-N(1)-)-methyltransferase(Haemophilus influenzae (strain ATCC 51907 / DSM 11...)
D3R/Abbott
LigandPNGBDBM225696(GTC000469A)
Affinity DataIC50:  501nM. Assay description: ScintillationProximity_Assay
Ligand InfoPC cidPC sidPDB