BDBM225964 FXR_55
SMILES COc1ccc(-c2nc3cc(F)c(F)cc3n2[C@@H](C2CCCCC2)C(=O)NC2CCCCC2)c(OC)n1
InChI Key InChIKey=FKBNYQFYOUQNHZ-VWLOTQADSA-N
Data  1 IC50
  Tab Delimited (TSV)   2D SDfile   Computed 3D by Vconf -m prep SDfile
Find this compound or compounds like it in BindingDB:
Activity Spreadsheet -- Enzyme Inhibition Constant Data from BindingDB
Found 1 hit for monomerid = 225964
TargetBile acid receptor(Homo sapiens (Human))
D3R/Abbott
LigandPNGBDBM225964(FXR_55)
Affinity DataIC50:  0.300nMpH: 7.4Assay Description:The assay buffer contained 50 mM HEPES (pH 7.4), 10 mM NaCl, 5 mM MgCl2 and 0.01% CHAPS. The reactions were incubated for 30 min in the presence of [...
Ligand InfoPC cidPC sid
In DepthDetails PubMed