BDBM234853 US9353116, 11
SMILES CCS(=O)(=O)Nc1cccc(Cc2nn(C(C)C)c3ncnc(N)c23)c1
InChI Key InChIKey=CZDNNNYBOADUFI-UHFFFAOYSA-N
Data  2 IC50
PDB links: 1 PDB ID matches this monomer.
  Tab Delimited (TSV)   2D SDfile   Computed 3D by Vconf -m prep SDfile
Find this compound or compounds like it in BindingDB:
Activity Spreadsheet -- Enzyme Inhibition Constant Data from BindingDB
Found 2 hits for monomerid = 234853
TargetProto-oncogene tyrosine-protein kinase Src [251-533,T338C](Gallus gallus (Chicken))
The Regents Of The University Of California
US Patent
LigandPNGBDBM234853(US9353116, 11)
Affinity DataIC50:  3.50E+3nMpH: 8.0Assay Description:In vitro kinase assays for c-Src variants were performed in 50 mM Tris (pH 8.0), 10 mM MgCl2 and 1 mg/mL BSA. When obtaining kinetic parameters (kcat...
Ligand InfoPC cidPC sidPDB
TargetProto-oncogene tyrosine-protein kinase Src [251-533](Gallus gallus (Chicken))
The Regents Of The University Of California
US Patent
LigandPNGBDBM234853(US9353116, 11)
Affinity DataIC50: >5.00E+3nMpH: 8.0Assay Description:In vitro kinase assays for c-Src variants were performed in 50 mM Tris (pH 8.0), 10 mM MgCl2 and 1 mg/mL BSA. When obtaining kinetic parameters (kcat...
Ligand InfoPC cidPC sidPDB