BDBM237939 US9394285, 20
SMILES OC(=O)c1c[nH]c2cc(F)c(c(F)c12)-c1ccc(cc1)C1(O)COC1
InChI Key InChIKey=NGVUCJQUYYULDY-UHFFFAOYSA-N
Data  1 EC50
  Tab Delimited (TSV)   2D SDfile   Computed 3D by Vconf -m prep SDfile
Find this compound or compounds like it in BindingDB:
Activity Spreadsheet -- Enzyme Inhibition Constant Data from BindingDB
Found 1 hit for monomerid = 237939
LigandPNGBDBM237939(US9394285, 20)
Affinity DataEC50:  53.6nMpH: 7.5 T: 2°C. Assay description: The biochemical EC50 (half-maximal concentration required for full activation) of compounds for the activation of AMPK was evaluated by 33P-based ass...
Ligand InfoPC cidPC sid
In DepthDetails US Patent