BDBM239113 US10195181, Example 13a::US9403810, 13b
SMILES CO[C@@H]1C[C@@H](O[C@@H](C1)C(C)(C)C)c1onc(C(=O)Nc2c(C)n(C)n(C3CCCCC3)c2=O)c1C
InChI Key InChIKey=PQYMHCJXFXWEBH-AQNXPRMDSA-N
Data  2 IC50
  Tab Delimited (TSV)   2D SDfile   Computed 3D by Vconf -m prep SDfile
Find this compound or compounds like it in BindingDB:
Activity Spreadsheet -- Enzyme Inhibition Constant Data from BindingDB
Found 2 hits for monomerid = 239113
TargetE3 ubiquitin-protein ligase SMURF1(Homo sapiens (Human))
Novartis
US Patent
LigandPNGBDBM239113(US10195181, Example 13a | US9403810, 13b)
Affinity DataIC50:  290nM. Assay description: To determine the HECT E3 ligase selectivity of the compounds, a panel of biochemical HECT E3 ligase autoubiquitinylation assays was employed (Smurf-1...
Ligand InfoPC cidPC sid
In DepthDetails US Patent
TargetE3 ubiquitin-protein ligase SMURF1 [420-757](Homo sapiens (Human))
Novartis
US Patent
LigandPNGBDBM239113(US10195181, Example 13a | US9403810, 13b)
Affinity DataIC50:  730nMT: 2°C. Assay description: For the biochemical assay panel, 50 nl of the test compounds, reference compounds and buffer/DMSO control are transferred to the respective wells of ...
Ligand InfoPC cidPC sid
In DepthDetails US Patent