BDBM243416 N-(2-methyl-1,3- thiazol-5-yl)-5- ((1R,2R)-2- (tetrahydro-2H- pyran-4-ylamino)- cyclopropyl)thio- phene-3-carboxamide::US10053456, 50::US10414761, Example 50::US9718814, 50::US9920047, 50
SMILES Cc1ncc(NC(=O)c2csc(c2)[C@@H]2C[C@H]2NC2CCOCC2)s1
InChI Key InChIKey=GRILTBXBBYWFBM-ZIAGYGMSSA-N
Data  15 IC50
  Tab Delimited (TSV)   2D SDfile   Computed 3D by Vconf -m prep SDfile
Find this compound or compounds like it in BindingDB:
Activity Spreadsheet -- Enzyme Inhibition Constant Data from BindingDB
Found 15 hits for monomerid = 243416
TargetLysine-specific histone demethylase 1A(Homo sapiens (Human))
Takeda Pharmaceutical
US Patent
LigandPNGBDBM243416(N-(2-methyl-1,3- thiazol-5-yl)-5- ((1R,2R)-2- (tet...)
Affinity DataIC50: <100nMpH: 8.0 T: 2°C. Assay description: A test compound dissolved in DMSO was added by to a reaction solution (50 mM Tris-HCl (pH 8.0), 0.1% BSA, 1 mM DTT) containing LSD1 enzyme, and the m...
Ligand InfoPC cidPC sid
In DepthDetails US Patent
TargetAmine oxidase [flavin-containing] B(Homo sapiens (Human))
Takeda Pharmaceutical
US Patent
LigandPNGBDBM243416(N-(2-methyl-1,3- thiazol-5-yl)-5- ((1R,2R)-2- (tet...)
Affinity DataIC50: >1.00E+5nM. Assay description: MAO-B: The MAO-B inhibitory activity evaluation described below followed the protocol of MAO-Glo (registered trademark) Assay of Promega KK.A test co...
Ligand InfoPC cidPC sid
In DepthDetails US Patent
TargetAmine oxidase [flavin-containing] B(Homo sapiens (Human))
Takeda Pharmaceutical
US Patent
LigandPNGBDBM243416(N-(2-methyl-1,3- thiazol-5-yl)-5- ((1R,2R)-2- (tet...)
Affinity DataIC50: >1.00E+5nMpH: 7.5 T: 2°C. Assay description: A test compound dissolved in DMSO was added to a reaction solution (100 mM HEPES (pH 7.5), 5% glycerol, 10% DMSO) containing MAO-B enzyme (Sigma-Aldr...
Ligand InfoPC cidPC sid
In DepthDetails US Patent
TargetLysine-specific histone demethylase 1A(Homo sapiens (Human))
Takeda Pharmaceutical
US Patent
LigandPNGBDBM243416(N-(2-methyl-1,3- thiazol-5-yl)-5- ((1R,2R)-2- (tet...)
Affinity DataIC50: <100nMpH: 8.0 T: 2°C. Assay description: A test compound dissolved in DMSO was added by to a reaction solution (50 mM Tris-HCl (pH 8.0), 0.1% BSA, 1 mM DTT) containing LSD1 enzyme, and the m...
Ligand InfoPC cidPC sid
In DepthDetails US Patent
TargetAmine oxidase [flavin-containing] A(Homo sapiens (Human))
Takeda Pharmaceutical
US Patent
LigandPNGBDBM243416(N-(2-methyl-1,3- thiazol-5-yl)-5- ((1R,2R)-2- (tet...)
Affinity DataIC50: >1.00E+5nMpH: 7.5 T: 2°C. Assay description: The MAO-A inhibitory activity evaluation described below followed the protocol of MAO-Glo (registered trademark) Assay of Promega KK.A test compound ...
Ligand InfoPC cidPC sid
In DepthDetails US Patent
TargetAmine oxidase [flavin-containing] B(Homo sapiens (Human))
Takeda Pharmaceutical
US Patent
LigandPNGBDBM243416(N-(2-methyl-1,3- thiazol-5-yl)-5- ((1R,2R)-2- (tet...)
Affinity DataIC50: >1.00E+5nMpH: 7.5 T: 2°C. Assay description: The MAO-B inhibitory activity evaluation described below followed the protocol of MAO-Glo (registered trademark) Assay of Promega KK.A test compound ...
Ligand InfoPC cidPC sid
In DepthDetails US Patent
TargetLysine-specific histone demethylase 1A(Homo sapiens (Human))
Takeda Pharmaceutical
US Patent
LigandPNGBDBM243416(N-(2-methyl-1,3- thiazol-5-yl)-5- ((1R,2R)-2- (tet...)
Affinity DataIC50: <100nMpH: 8.0 T: 2°C. Assay description: A test compound dissolved in DMSO was added by to a reaction solution (50 mM Tris-HCl (pH 8.0), 0.1% BSA, 1 mM DTT) containing LSD1 enzyme, and the m...
Ligand InfoPC cidPC sid
In DepthDetails US Patent
TargetAmine oxidase [flavin-containing] A(Homo sapiens (Human))
Takeda Pharmaceutical
US Patent
LigandPNGBDBM243416(N-(2-methyl-1,3- thiazol-5-yl)-5- ((1R,2R)-2- (tet...)
Affinity DataIC50: >1.00E+5nMpH: 7.5 T: 2°C. Assay description: The MAO-A inhibitory activity evaluation described below followed the protocol of MAO-Glo (registered trademark) Assay of Promega KK.A test compound ...
Ligand InfoPC cidPC sid
In DepthDetails US Patent
TargetAmine oxidase [flavin-containing] B(Homo sapiens (Human))
Takeda Pharmaceutical
US Patent
LigandPNGBDBM243416(N-(2-methyl-1,3- thiazol-5-yl)-5- ((1R,2R)-2- (tet...)
Affinity DataIC50: >1.00E+5nMpH: 7.5 T: 2°C. Assay description: The MAO-B inhibitory activity evaluation described below followed the protocol of MAO-Glo (registered trademark) Assay of Promega KK.A test compound ...
Ligand InfoPC cidPC sid
In DepthDetails US Patent
TargetLysine-specific histone demethylase 1A(Homo sapiens (Human))
Takeda Pharmaceutical
US Patent
LigandPNGBDBM243416(N-(2-methyl-1,3- thiazol-5-yl)-5- ((1R,2R)-2- (tet...)
Affinity DataIC50: <100nM. Assay description: A test compound dissolved in DMSO was added by to a reaction solution (50 mM Tris-HCl (pH 8.0), 0.1% BSA, 1 mM DTT) containing LSD1 enzyme, and the m...
Ligand InfoPC cidPC sid
In DepthDetails US Patent
TargetAmine oxidase [flavin-containing] A(Homo sapiens (Human))
Takeda Pharmaceutical
US Patent
LigandPNGBDBM243416(N-(2-methyl-1,3- thiazol-5-yl)-5- ((1R,2R)-2- (tet...)
Affinity DataIC50: >1.00E+5nM. Assay description: A test compound dissolved in DMSO was added to a reaction solution (100 mM HEPES (pH 7.5), 5% glycerol) containing MAO-A enzyme (Sigma-Aldrich Co. LL...
Ligand InfoPC cidPC sid
In DepthDetails US Patent
TargetAmine oxidase [flavin-containing] B(Homo sapiens (Human))
Takeda Pharmaceutical
US Patent
LigandPNGBDBM243416(N-(2-methyl-1,3- thiazol-5-yl)-5- ((1R,2R)-2- (tet...)
Affinity DataIC50: >1.00E+5nM. Assay description: A test compound dissolved in DMSO was added to a reaction solution (100 mM HEPES (pH 7.5), 5% glycerol, 10% DMSO) containing MAO-B enzyme (Sigma-Aldr...
Ligand InfoPC cidPC sid
In DepthDetails US Patent
TargetLysine-specific histone demethylase 1A(Homo sapiens (Human))
Takeda Pharmaceutical
US Patent
LigandPNGBDBM243416(N-(2-methyl-1,3- thiazol-5-yl)-5- ((1R,2R)-2- (tet...)
Affinity DataIC50: <100nM. Assay description: LSD1: A test compound dissolved in DMSO was added by to a reaction solution (50 mM Tris-HCl (pH 8.0), 0.1% BSA, 1 mM DTT) containing LSD1 enzyme, and...
Ligand InfoPC cidPC sid
In DepthDetails US Patent
TargetAmine oxidase [flavin-containing] A(Homo sapiens (Human))
Takeda Pharmaceutical
US Patent
LigandPNGBDBM243416(N-(2-methyl-1,3- thiazol-5-yl)-5- ((1R,2R)-2- (tet...)
Affinity DataIC50: >1.00E+5nM. Assay description: MAO-A: The MAO-A inhibitory activity evaluation described below followed the protocol of MAO-Glo (registered trademark) Assay of Promega KK.A test co...
Ligand InfoPC cidPC sid
In DepthDetails US Patent
TargetAmine oxidase [flavin-containing] A(Homo sapiens (Human))
Takeda Pharmaceutical
US Patent
LigandPNGBDBM243416(N-(2-methyl-1,3- thiazol-5-yl)-5- ((1R,2R)-2- (tet...)
Affinity DataIC50: >1.00E+5nMpH: 7.5 T: 2°C. Assay description: A test compound dissolved in DMSO was added to a reaction solution (100 mM HEPES (pH 7.5), 5% glycerol) containing MAO-A enzyme (Sigma-Aldrich Co. LL...
Ligand InfoPC cidPC sid
In DepthDetails US Patent