BDBM251699 US10100018, Example 35::US9464060, 35
SMILES OC(=O)c1ccc(CN(CC2CC2)C(=O)c2ccc(Oc3ccccc3Cl)cc2)cc1
InChI Key InChIKey=QSIZRACEBIMNLS-UHFFFAOYSA-N
Data  2 IC50
  Tab Delimited (TSV)   2D SDfile   Computed 3D by Vconf -m prep SDfile
Find this compound or compounds like it in BindingDB:
Activity Spreadsheet -- Enzyme Inhibition Constant Data from BindingDB
Found 2 hits for monomerid = 251699
TargetLysophosphatidic acid receptor 1(Homo sapiens (Human))
Takeda Pharmaceutical
US Patent
LigandPNGBDBM251699(US10100018, Example 35 | US9464060, 35)
Affinity DataIC50:  7nMT: 2°C. Assay description: Engagement of the LPA1 receptor by its ligand, oleoyl-L-α-lysophosphatidic acid (LPA), leads to the release of intracellular stores of calcium i...
Ligand InfoPC cidPC sid
In DepthDetails US Patent
TargetLysophosphatidic acid receptor 5(Homo sapiens (Human))
Takeda Pharmaceutical
US Patent
LigandPNGBDBM251699(US10100018, Example 35 | US9464060, 35)
Affinity DataIC50:  7nMT: 2°C. Assay description: Engagement of the LPA5 receptor by its ligand, oleoyl-L-α-lysophosphatidic acid (LPA), leads to the release of intracellular stores of calcium into ...
Ligand InfoPC cidPC sid
In DepthDetails US Patent