BDBM25205 2,4-Pyrimidine derivative, 7::4-N-(5-chloro-2H-1,3-benzodioxol-4-yl)-2-N-(3,4,5-trimethoxyphenyl)pyrimidine-2,4-diamine
SMILES COc1cc(Nc2nccc(Nc3c4OCOc4ccc3Cl)n2)cc(OC)c1OC
InChI Key InChIKey=HMKLUOPMOJOUDZ-UHFFFAOYSA-N
Data  1 IC50
PDB links: 1 PDB ID matches this monomer.
  Tab Delimited (TSV)   2D SDfile   Computed 3D by Vconf -m prep SDfile
Find this compound or compounds like it in BindingDB:
Activity Spreadsheet -- Enzyme Inhibition Constant Data from BindingDB
Found 1 hit for monomerid = 25205
TargetEphrin type-B receptor 4(Homo sapiens (Human))
Astrazeneca
LigandPNGBDBM25205(2,4-Pyrimidine derivative, 7 | 4-N-(5-chloro-2H-1,...)
Affinity DataIC50:  240nMpH: 7.4 T: 2°C. Assay description: This assay detects inhibitors of EphB4-mediated phosphorylation of a polypeptide substrate using Alphascreen luminescence detection technology. The r...