BDBM265519 US9718808, 41
SMILES CC1=C(COC1=O)N1CC[C@@]2(CC[C@@H](CC2)NCc2ccc(cc2)-n2ncnn2)C1=O
InChI Key InChIKey=WDAOUWYJDOUQOS-VVOJOOEHSA-N
Data  1 IC50
  Tab Delimited (TSV)   2D SDfile   Computed 3D by Vconf -m prep SDfile
Find this compound or compounds like it in BindingDB:
Activity Spreadsheet -- Enzyme Inhibition Constant Data from BindingDB
Found 1 hit for monomerid = 265519
TargetATP-sensitive inward rectifier potassium channel 1(Homo sapiens (Human))
Merck Sharp & Dohme
US Patent
LigandPNGBDBM265519(US9718808, 41)
Affinity DataIC50:  3.30nM. Assay description: A Thallium Flux Assay was performed on each of the final product compounds of the Examples. This assay has been described previously; see, e.g., PCT ...
Ligand InfoPC cidPC sid
In DepthDetails US Patent