BDBM267064 Benzyl 4-{[(4,5-dichloro-2-thienyl)sulfonyl]amino}-2-hydroxybenzoate::US9718809, 71
SMILES Oc1cc(NS(=O)(=O)c2cc(Cl)c(Cl)s2)ccc1C(=O)OCc1ccccc1
InChI Key InChIKey=GVBVFUMRRYJPLO-UHFFFAOYSA-N
Data  1 IC50
  Tab Delimited (TSV)   2D SDfile   Computed 3D by Vconf -m prep SDfile
Find this compound or compounds like it in BindingDB:
Activity Spreadsheet -- Enzyme Inhibition Constant Data from BindingDB
Found 1 hit for monomerid = 267064
Target6-phosphofructo-2-kinase/fructose-2,6-bisphosphatase 4(Homo sapiens (Human))
Kancera
US Patent
LigandPNGBDBM267064(Benzyl 4-{[(4,5-dichloro-2-thienyl)sulfonyl]amino}...)
Affinity DataIC50:  800nM. Assay description: 6-phosphofructo-2-kinase/fructose-2,6-bisphosphatase (PFK-2/BPase-2) is a bi-functional enzyme that catalyses the formation and degradation of fructo...
Ligand InfoPC cidPC sid
In DepthDetails US Patent