BDBM267080 General Procedure 14::US9718809, 230
SMILES Oc1ccc(F)cc1-c1cccc(c1)S(=O)(=O)Nc1ccc(C(=O)OCCCNc2cccnc2)c(O)c1
InChI Key InChIKey=DQSRVWNGCNSDNE-UHFFFAOYSA-N
Data  1 IC50
  Tab Delimited (TSV)   2D SDfile   Computed 3D by Vconf -m prep SDfile
Find this compound or compounds like it in BindingDB:
Activity Spreadsheet -- Enzyme Inhibition Constant Data from BindingDB
Found 1 hit for monomerid = 267080
Target6-phosphofructo-2-kinase/fructose-2,6-bisphosphatase 4(Homo sapiens (Human))
Kancera
US Patent
LigandPNGBDBM267080(General Procedure 14 | US9718809, 230)
Affinity DataIC50:  1.90E+3nM. Assay description: 6-phosphofructo-2-kinase/fructose-2,6-bisphosphatase (PFK-2/BPase-2) is a bi-functional enzyme that catalyses the formation and degradation of fructo...
Ligand InfoPC cidPC sid
In DepthDetails US Patent