BDBM267967 (3aR,5R,6S,7R,7aR)-5-(((4- fluorobenzyl)oxy)methyl)-2- (methylamino)-5,6,7,7a-tetrahydro- 3aH-pyrano[3,2-d]thiazole-6,7-diol::US9718854, 63
SMILES CNC1=N[C@H]2[C@H](O[C@H](COCc3ccc(F)cc3)[C@@H](O)[C@@H]2O)S1
InChI Key InChIKey=MEOSAVXRUMPVOM-DHGKCCLASA-N
Data  1 KI
  Tab Delimited (TSV)   2D SDfile   Computed 3D by Vconf -m prep SDfile
Find this compound or compounds like it in BindingDB:
Activity Spreadsheet -- Enzyme Inhibition Constant Data from BindingDB
Found 1 hit for monomerid = 267967
Target4-hydroxy-2-oxoglutarate aldolase, mitochondrial(Homo sapiens (Human))
Alectos Therapeutics
US Patent
LigandPNGBDBM267967((3aR,5R,6S,7R,7aR)-5-(((4- fluorobenzyl)oxy)methyl...)
Affinity DataKi:  25nM ΔG°:  -10.4kcal/molepH: 7.0 T: 2°C. Assay description: Enzymatic reactions were carried out in a reaction containing 50 mM NaH2PO4, 100 mM NaCl and 0.1% BSA (pH 7.0) using 2 mM 4-Methylumbelliferyl N-acet...
Ligand InfoPC cidPC sid
In DepthDetails US Patent