BDBM26802 (5R,7R,8S)-7-N-(4-{[2-(2-fluoropropan-2-yl)-1H-1,3-benzodiazol-1-yl]methyl}benzene)-8-N-hydroxy-1-oxaspiro[4.4]nonane-7,8-dicarboxamide::benzimidazole analog., 28
SMILES CC(C)(F)c1nc2ccccc2n1Cc1ccc(cc1)C(=O)N[C@@H]1C[C@@]2(CCCO2)C[C@@H]1C(=O)NO
InChI Key InChIKey=BEHWVPRIGLRXIG-LPOPLRKUSA-N
Data  1 IC50
  Tab Delimited (TSV)   2D SDfile   Computed 3D by Vconf -m prep SDfile
Find this compound or compounds like it in BindingDB:
Activity Spreadsheet -- Enzyme Inhibition Constant Data from BindingDB
Found 1 hit for monomerid = 26802
TargetDisintegrin and metalloproteinase domain-containing protein 17(Sus scrofa (pig))
Bristol-Myers Squibb
LigandPNGBDBM26802((5R,7R,8S)-7-N-(4-{[2-(2-fluoropropan-2-yl)-1H-1,3...)
Affinity DataIC50: <1nMpH: 7.5 T: 2°C. Assay description: The compounds were tested for enzyme inhibition using fluorescence resonance energy transfer (FRET) assay. Fluorescence measurements were performed i...
In DepthDetails ArticlePubMed