BDBM26807 (3R,4S)-3-N-hydroxy-4-N-(4-{[2-(trifluoromethyl)-1H-1,3-benzodiazol-1-yl]methyl}benzene)oxolane-3,4-dicarboxamide::benzimidazole analog., 33
SMILES ONC(=O)[C@H]1COC[C@H]1NC(=O)c1ccc(Cn2c(nc3ccccc23)C(F)(F)F)cc1
InChI Key InChIKey=JADBDFQEPJQPBJ-GOEBONIOSA-N
Data  1 IC50
  Tab Delimited (TSV)   2D SDfile   Computed 3D by Vconf -m prep SDfile
Find this compound or compounds like it in BindingDB:
Activity Spreadsheet -- Enzyme Inhibition Constant Data from BindingDB
Found 1 hit for monomerid = 26807
TargetDisintegrin and metalloproteinase domain-containing protein 17(Sus scrofa (pig))
Bristol-Myers Squibb
LigandPNGBDBM26807((3R,4S)-3-N-hydroxy-4-N-(4-{[2-(trifluoromethyl)-1...)
Affinity DataIC50:  1nMpH: 7.5 T: 2°C. Assay description: The compounds were tested for enzyme inhibition using fluorescence resonance energy transfer (FRET) assay. Fluorescence measurements were performed i...
In DepthDetails ArticlePubMed