BDBM271257 US10059720, Example 72::US10975091, Example 72
SMILES CC(C)C[C@H](N)[C@](O)(Cc1cc(OCCC(C)(C)C)c(C)cn1)C(O)=O
InChI Key InChIKey=DIXUCSKTBNMGTR-FXAWDEMLSA-N
Data  4 IC50
  Tab Delimited (TSV)   2D SDfile   Computed 3D by Vconf -m prep SDfile
Find this compound or compounds like it in BindingDB:
Activity Spreadsheet -- Enzyme Inhibition Constant Data from BindingDB
Found 4 hits for monomerid = 271257
TargetLeucyl-cystinyl aminopeptidase(Rattus norvegicus)
Astellas Pharma
US Patent
LigandPNGBDBM271257(US10059720, Example 72 | US10975091, Example 72)
Affinity DataIC50:  0.770nM. Assay description: Rat epididymal fat pads were homogenized and subjected to ultracentrifugation at 100,000×g for 30 minutes to obtain microsomes containing IRAP. The m...
Ligand InfoPC cidPC sid
In DepthDetails US Patent
TargetLeucyl-cystinyl aminopeptidase(Homo sapiens (Human))
Astellas Pharma
US Patent
LigandPNGBDBM271257(US10059720, Example 72 | US10975091, Example 72)
Affinity DataIC50:  0.940nM. Assay description: hP-LAP: HEK293 cells forced to transiently express hP-LAP were prepared by lipofection, homogenized, and then subjected to ultracentrifugation at 100...
Ligand InfoPC cidPC sid
In DepthDetails US Patent
TargetLeucyl-cystinyl aminopeptidase(Rattus norvegicus)
Astellas Pharma
US Patent
LigandPNGBDBM271257(US10059720, Example 72 | US10975091, Example 72)
Affinity DataIC50:  0.770nM. Assay description: IRAP: Rat epididymal fat pads were homogenized and subjected to ultracentrifugation at 100,000×g for 30 minutes to obtain microsomes containing IRAP....
Ligand InfoPC cidPC sid
In DepthDetails US Patent
TargetLeucyl-cystinyl aminopeptidase(Homo sapiens (Human))
Astellas Pharma
US Patent
LigandPNGBDBM271257(US10059720, Example 72 | US10975091, Example 72)
Affinity DataIC50:  0.940nM. Assay description: HEK293 cells forced to transiently express hP-LAP (J Biol Chem 1996; 271: 56-61) were prepared by lipofection, homogenized, and then subjected to ult...
Ligand InfoPC cidPC sid
In DepthDetails US Patent