BDBM275085 US10221195, Example 27::US9879032, Example 27
SMILES COc1ccc(Cl)cc1S(=O)(=O)Nc1cnc2OC[C@H](CO)NC(=O)c2c1
InChI Key InChIKey=PMCTUNCPKNEWPM-NSHDSACASA-N
Data  2 IC50
  Tab Delimited (TSV)   2D SDfile   Computed 3D by Vconf -m prep SDfile
Find this compound or compounds like it in BindingDB:
Activity Spreadsheet -- Enzyme Inhibition Constant Data from BindingDB
Found 2 hits for monomerid = 275085
TargetAlkaline phosphatase, tissue-nonspecific isozyme(Homo sapiens (Human))
Daiichi Sankyo
US Patent
LigandPNGBDBM275085(US10221195, Example 27 | US9879032, Example 27)
Affinity DataIC50:  1.5nM. Assay description: COS1 cells (DS Pharma Biomedical Co., Ltd.) were transfected with human TNAP (OriGene Technologies, Inc.) using Lipofectamine LTX & Plus reagent (Inv...
Ligand InfoPC cidPC sid
In DepthDetails US Patent
TargetAlkaline phosphatase, tissue-nonspecific isozyme(Homo sapiens (Human))
Daiichi Sankyo
US Patent
LigandPNGBDBM275085(US10221195, Example 27 | US9879032, Example 27)
Affinity DataIC50:  1.5nMT: 2°C. Assay description: COS 1 cells (DS Pharma Biomedical Co., Ltd.) were transfected with human TNAP (OriGene Technologies, Inc.) using Lipofectamine LTX & Plus reagent (In...
Ligand InfoPC cidPC sid
In DepthDetails US Patent