BDBM281023 (7S,10S,13S)-13-((1H-Indol-3-yl)methyl)-10-(4-aminobutyl)-7-(3-aminopropyl)-18-(2-methoxypyridin-4-yl)-12-methyl-6,7,9,10,12,13,15,16-octahydrodipyrido[2,3-b:2',3'-p][1,5,8,11,14]thiatetraazacycloheptadecine-8,11,14(5H)-trione::US10030047, Example 217
SMILES COc1cc(ccn1)-c1ccc2Sc3ncccc3CN[C@@H](CCCN)C(=O)N[C@@H](CCCCN)C(=O)N(C)[C@@H](Cc3c[nH]c4ccccc34)C(=O)NCc2n1
InChI Key
Data  1 IC50
  Tab Delimited (TSV)   2D SDfile   Computed 3D by Vconf -m prep SDfile
Find this compound or compounds like it in BindingDB:
Activity Spreadsheet -- Enzyme Inhibition Constant Data from BindingDB
Found 1 hit for monomerid = 281023
TargetAdhesin Ata autotransporter(Acinetobacter baumannii (strain ATCC 17978 / CIP 5...)
Hoffmann-La Roche
US Patent
LigandPNGBDBM281023((7S,10S,13S)-13-((1H-Indol-3-yl)methyl)-10-(4-amin...)
Affinity DataIC50:  1.00E+3nM. Assay description: The in vitro antimicrobial activity of the compounds was alternatively determined according to the following procedure:The assay used a 10-points Iso...
Ligand InfoPC cidPC sid
In DepthDetails US Patent