BDBM281835 2-({[5-(4-aminoquinazolin-6- yl)thiophen-2-yl]methyl}amino)- N-(3,4,5-trifluorobenzyl)pyridine- 3-carboxamide (TFA salt)::US10030016, Example 3.23
SMILES Nc1ncnc2ccc(cc12)-c1ccc(CNc2ncccc2C(=O)NCc2cc(F)c(F)c(F)c2)s1
InChI Key InChIKey=ZSMMYHNCASLXIP-UHFFFAOYSA-N
Data  1 IC50
  Tab Delimited (TSV)   2D SDfile   Computed 3D by Vconf -m prep SDfile
Find this compound or compounds like it in BindingDB:
Activity Spreadsheet -- Enzyme Inhibition Constant Data from BindingDB
Found 1 hit for monomerid = 281835
Target3-phosphoinositide-dependent protein kinase 1 [51-359](Homo sapiens (Human))
Sunesis Pharmaceuticals
US Patent
LigandPNGBDBM281835(2-({[5-(4-aminoquinazolin-6- yl)thiophen-2-yl]meth...)
Affinity DataIC50: <100nM. Assay description: PDK1 (amino acids 51-359) and AKT2 (amino acids 140-467 fused to PIFtide, amino acids EEQEMFRDFDYIADW) were expressed as N-terminally tagged GST fusi...
Ligand InfoPC cidPC sid
In DepthDetails US Patent