BDBM28323 (1R,2S)-1-{[4-(4-chlorophenyl)benzene][2-(2,5-dioxopyrrolidin-1-yl)ethyl]sulfonamido}-2-phenylcyclopropane-1-carboxylic acid::sulfonylamino-alkanecarboxylate, 37
SMILES OC(=O)[C@]1(C[C@H]1c1ccccc1)N(CCN1C(=O)CCC1=O)S(=O)(=O)c1ccc(cc1)-c1ccc(Cl)cc1
InChI Key InChIKey=ULPTZGQSFJCQJX-RBJSKKJNSA-N
Data  1 IC50
  Tab Delimited (TSV)   2D SDfile   Computed 3D by Vconf -m prep SDfile
Find this compound or compounds like it in BindingDB:
Activity Spreadsheet -- Enzyme Inhibition Constant Data from BindingDB
Found 1 hit for monomerid = 28323
LigandPNGBDBM28323((1R,2S)-1-{[4-(4-chlorophenyl)benzene][2-(2,5-diox...)
Affinity DataIC50:  310nMpH: 7.5 T: 2°C. Assay description: The ADAMTS-5 (Aggrecanase-2) assay was performed using fluorescent peptide substrate WAAG-3R and the recombinant Agg-2 pre-incubated with various con...
In DepthDetails ArticlePubMed