BDBM28430 (2R,3R,4S,5R)-2-(6-amino-9H-purin-9-yl)-5-({[4-(aminooxy)butyl](methyl)amino}methyl)oxolane-3,4-diol::AdoMet substrate analogue, 14f
SMILES CN(CCCCON)C[C@H]1O[C@H]([C@H](O)[C@@H]1O)n1cnc2c(N)ncnc12
InChI Key InChIKey=DKXDBXISCUQBMT-SDBHATRESA-N
Data  1 IC50
  Tab Delimited (TSV)   2D SDfile   Computed 3D by Vconf -m prep SDfile
Find this compound or compounds like it in BindingDB:
Activity Spreadsheet -- Enzyme Inhibition Constant Data from BindingDB
Found 1 hit for monomerid = 28430
TargetS-adenosylmethionine decarboxylase proenzyme(Homo sapiens (Human))
Cornell University
LigandPNGBDBM28430((2R,3R,4S,5R)-2-(6-amino-9H-purin-9-yl)-5-({[4-(am...)
Affinity DataIC50:  18nMpH: 6.8 T: 2°C. Assay description: The C-terminal his-tagged AdoMetDC was assayed by measuring the release of 14CO2 from S-adenosyl-L-[carboxy-14C]methionine (Amersham Pharmacia Biotec...
In DepthDetails ArticlePubMed