BDBM28597 4-{2-methyl-3-[(3-methylphenyl)methoxy]phenyl}piperidine::tolylpiperidine, 9d
SMILES Cc1cccc(COc2cccc(C3CCNCC3)c2C)c1
InChI Key InChIKey=FPVSFLULAWRZQM-UHFFFAOYSA-N
Data  1 KI
  Tab Delimited (TSV)   2D SDfile   Computed 3D by Vconf -m prep SDfile
Find this compound or compounds like it in BindingDB:
Activity Spreadsheet -- Enzyme Inhibition Constant Data from BindingDB
Found 1 hit for monomerid = 28597
Target5-hydroxytryptamine receptor 6(Homo sapiens (Human))
Pfizer
LigandPNGBDBM28597(4-{2-methyl-3-[(3-methylphenyl)methoxy]phenyl}pipe...)
Affinity DataKi:  92.5nM ΔG°:  -9.49kcal/molepH: 7.5 T: 2°C. Assay description: Competition experiments were performed in the presence radioligand with membrane protein (obtained from cells expressing the receptor) and test compo...
In DepthDetails ArticlePubMed