BDBM28625 2-methyl-3-(piperidin-4-yl)phenyl benzenesulfonate::tolylpiperidine, 18a
SMILES Cc1c(OS(=O)(=O)c2ccccc2)cccc1C1CCNCC1
InChI Key InChIKey=FHSWWFYSXOSTCT-UHFFFAOYSA-N
Data  1 KI
  Tab Delimited (TSV)   2D SDfile   Computed 3D by Vconf -m prep SDfile
Find this compound or compounds like it in BindingDB:
Activity Spreadsheet -- Enzyme Inhibition Constant Data from BindingDB
Found 1 hit for monomerid = 28625
Target5-hydroxytryptamine receptor 6(Homo sapiens (Human))
Pfizer
LigandPNGBDBM28625(2-methyl-3-(piperidin-4-yl)phenyl benzenesulfonate...)
Affinity DataKi:  19.6nM ΔG°:  -10.5kcal/moleT: 2°C. Assay description: Competition experiments were performed in the presence radioligand with membrane protein (obtained from cells expressing the receptor) and test compo...
In DepthDetails ArticlePubMed