BDBM29453 Pyrazolo[1,5-a]-1,3,5-triazine, 12-22
SMILES CCCN(CC1CC1)c1nc(C)nc2c(c(C)nn12)-c1c(C)cc(OC)cc1OC
InChI Key InChIKey=OEFGJUHHGUGSEW-UHFFFAOYSA-N
Data  1 IC50
  Tab Delimited (TSV)   2D SDfile   Computed 3D by Vconf -m prep SDfile
Find this compound or compounds like it in BindingDB:
Activity Spreadsheet -- Enzyme Inhibition Constant Data from BindingDB
Found 1 hit for monomerid = 29453
TargetCorticotropin-releasing factor receptor 1(Rattus norvegicus (rat))
Bristol-Myers Squibb
LigandPNGBDBM29453(Pyrazolo[1,5-a]-1,3,5-triazine, 12-22)
Affinity DataIC50:  1.48nMpH: 7.2 T: 2°C. Assay description: Naive rats were sacrificed by decapitation, and the brain and pituitary were collected. Slide-mounted brain sections were preincubated in an assay so...
In DepthDetails ArticlePubMed