BDBM29695 MLS000689748::N-(2,5-dimethoxyphenyl)sulfonyl-N-(2-keto-1,3-benzoxathiol-5-yl)acetamide::N-(2,5-dimethoxyphenyl)sulfonyl-N-(2-oxidanylidene-1,3-benzoxathiol-5-yl)ethanamide::N-(2,5-dimethoxyphenyl)sulfonyl-N-(2-oxo-1,3-benzoxathiol-5-yl)acetamide::N-[(2,5-dimethoxyphenyl)sulfonyl]-N-(2-oxo-1,3-benzoxathiol-5-yl)acetamide::SMR000313352::cid_5122341
SMILES COc1ccc(OC)c(c1)S(=O)(=O)N(C(C)=O)c1ccc2oc(=O)sc2c1
InChI Key InChIKey=QCQHKYRUVIIDKR-UHFFFAOYSA-N
Data  2 IC50
  Tab Delimited (TSV)   2D SDfile   Computed 3D by Vconf -m prep SDfile
Find this compound or compounds like it in BindingDB:
Activity Spreadsheet -- Enzyme Inhibition Constant Data from BindingDB
Found 2 hits for monomerid = 29695
TargetRunt-related transcription factor 1(Homo sapiens (Human))
Burnham Center For Chemical Genomics
Curated by PubChem BioAssay
LigandPNGBDBM29695(MLS000689748 | N-(2,5-dimethoxyphenyl)sulfonyl-N-(...)
Affinity DataIC50:  1.00E+5nMpH: 7.4 T: 2°C. Assay description: This assay is to use HTS to identify inhibitors of the protein-protein interaction between the RUNX1 Runt domain and CBFbeta-SMMHC, a potential thera...
In DepthDetails PCBioAssay
TargetRunt-related transcription factor 1(Homo sapiens (Human))
Burnham Center For Chemical Genomics
Curated by PubChem BioAssay
LigandPNGBDBM29695(MLS000689748 | N-(2,5-dimethoxyphenyl)sulfonyl-N-(...)
Affinity DataIC50:  1.00E+5nMpH: 7.4 T: 2°C. Assay description: This assay is to identify inhibitors of the protein-protein interaction between the RUNX1 Runt domain and CBFbeta-SMMHC. This is accomplished by usin...
In DepthDetails PCBioAssay