BDBM298362 US10124003, Ex. Compound 28::US10835536, Ex. Comp 28::US10894048, Ex Comp 28
SMILES COc1cc(OC)cc(c1)C#Cc1nn([C@H]2C[C@@H](CO)N(C2)C(=O)C=C)c2ncnc(N)c12
InChI Key InChIKey=FJYGEUHEYMHEHG-HOTGVXAUSA-N
Data  3 IC50
  Tab Delimited (TSV)   2D SDfile   Computed 3D by Vconf -m prep SDfile
Find this compound or compounds like it in BindingDB:
Activity Spreadsheet -- Enzyme Inhibition Constant Data from BindingDB
Found 3 hits for monomerid = 298362
TargetFibroblast growth factor receptor 2(Homo sapiens (Human))
Taiho Pharmaceutical
US Patent
LigandPNGBDBM298362(US10124003, Ex. Compound 28 | US10835536, Ex. Comp...)
Affinity DataIC50:  3.70nM. Assay description: When setting conditions for the measurement of the inhibitory effect of the compounds on FGFR2 kinase activity, FL-Peptide 22 (Caliper Life Sciences,...
Ligand InfoPC cidPC sid
In DepthDetails US Patent
TargetFibroblast growth factor receptor 2(Homo sapiens (Human))
Taiho Pharmaceutical
US Patent
LigandPNGBDBM298362(US10124003, Ex. Compound 28 | US10835536, Ex. Comp...)
Affinity DataIC50:  3.70nM. Assay description: When setting conditions for the measurement of the inhibitory effect of the compounds on FGFR2 kinase activity, FL-Peptide 22 (Caliper Life Sciences,...
Ligand InfoPC cidPC sid
In DepthDetails US Patent
TargetFibroblast growth factor receptor 2(Homo sapiens (Human))
Taiho Pharmaceutical
US Patent
LigandPNGBDBM298362(US10124003, Ex. Compound 28 | US10835536, Ex. Comp...)
Affinity DataIC50:  3.70nM. Assay description: When setting conditions for the measurement of the inhibitory effect of the compounds on FGFR2 kinase activity, FL-Peptide 22 (Caliper Life Sciences,...
Ligand InfoPC cidPC sid
In DepthDetails US Patent