BDBM298438 4-((4-((4-(3-(5-(tert-Butyl)-2-methoxy-3-(methylsulfonamido)phenyl)ureido)naphthalen-1-yloxy)pyridin-2-yl)amino)-2-(dimethylamino)-N-(2-morpholinoethyl)benzamide::US10125100, Example 21::US10392346, Example 21::US10941115, Example 21::US9751837, Example 21
SMILES COc1c(NC(=O)Nc2ccc(Oc3ccnc(Nc4ccc(C(=O)NCCN5CCOCC5)c(c4)N(C)C)c3)c3ccccc23)cc(cc1NS(C)(=O)=O)C(C)(C)C
InChI Key InChIKey=PXOGHMDWJDTSBR-UHFFFAOYSA-N
Data  2 IC50
  Tab Delimited (TSV)   2D SDfile   Computed 3D by Vconf -m prep SDfile
Find this compound or compounds like it in BindingDB:
Activity Spreadsheet -- Enzyme Inhibition Constant Data from BindingDB
Found 2 hits for monomerid = 298438
TargetTyrosine-protein kinase SYK(Homo sapiens (Human))
Topivert Pharma
US Patent
LigandPNGBDBM298438(4-((4-((4-(3-(5-(tert-Butyl)-2-methoxy-3-(methylsu...)
Affinity DataIC50:  15nM. Assay description: c-Src and Syk: The inhibitory activities of compounds of the invention against c-Src and Syk enzymes (Invitrogen), are evaluated in a similar fashion...
Ligand InfoPC cidPC sid
In DepthDetails US Patent
TargetProto-oncogene tyrosine-protein kinase Src(Homo sapiens (Human))
Topivert Pharma
US Patent
LigandPNGBDBM298438(4-((4-((4-(3-(5-(tert-Butyl)-2-methoxy-3-(methylsu...)
Affinity DataIC50:  16nM. Assay description: c-Src and Syk: The inhibitory activities of compounds of the invention against c-Src and Syk enzymes (Invitrogen), are evaluated in a similar fashion...
Ligand InfoPC cidPC sid
In DepthDetails US Patent