BDBM298441 4-((4-((4-(3-(5-(tert-Butyl)-2-methoxy-3-(methylsulfonamido)phenyl)ureido)naphthalen-1-yl)oxy)pyridin-2-yl)amino)-N-(2-(2-(2-hydroxyethoxy)ethoxy)ethyl)-2,6-dimethoxybenzamide::US10125100, Example 36::US10392346, Example 36::US10941115, Example 36::US9751837, Example 36
SMILES COc1cc(Nc2cc(Oc3ccc(NC(=O)Nc4cc(cc(NS(C)(=O)=O)c4OC)C(C)(C)C)c4ccccc34)ccn2)cc(OC)c1C(=O)NCCOCCOCCO
InChI Key InChIKey=NZIUKWCXTXDJLH-UHFFFAOYSA-N
Data  4 IC50
  Tab Delimited (TSV)   2D SDfile   Computed 3D by Vconf -m prep SDfile
Find this compound or compounds like it in BindingDB:
Activity Spreadsheet -- Enzyme Inhibition Constant Data from BindingDB
Found 4 hits for monomerid = 298441
TargetPotassium voltage-gated channel subfamily H member 2(Homo sapiens (Human))
Topivert Pharma
US Patent
LigandPNGBDBM298441(4-((4-((4-(3-(5-(tert-Butyl)-2-methoxy-3-(methylsu...)
Affinity DataIC50: >1.10E+4nM. Assay description: ompounds of the invention were tested for inhibition of the human ether a go-go (hERG) channel using IonWorks patch clamp electrophysiology at Essen ...
Ligand InfoPC cidPC sid
In DepthDetails US Patent
TargetTyrosine-protein kinase SYK(Homo sapiens (Human))
Topivert Pharma
US Patent
LigandPNGBDBM298441(4-((4-((4-(3-(5-(tert-Butyl)-2-methoxy-3-(methylsu...)
Affinity DataIC50:  190nM. Assay description: c-Src and Syk: The inhibitory activities of compounds of the invention against c-Src and Syk enzymes (Invitrogen), are evaluated in a similar fashion...
Ligand InfoPC cidPC sid
In DepthDetails US Patent
TargetProto-oncogene tyrosine-protein kinase Src(Homo sapiens (Human))
Topivert Pharma
US Patent
LigandPNGBDBM298441(4-((4-((4-(3-(5-(tert-Butyl)-2-methoxy-3-(methylsu...)
Affinity DataIC50:  10nM. Assay description: c-Src and Syk: The inhibitory activities of compounds of the invention against c-Src and Syk enzymes (Invitrogen), are evaluated in a similar fashion...
Ligand InfoPC cidPC sid
In DepthDetails US Patent
TargetBaculoviral IAP repeat-containing protein 2 [174-256](Homo sapiens (Human))
Topivert Pharma
US Patent
LigandPNGBDBM298441(4-((4-((4-(3-(5-(tert-Butyl)-2-methoxy-3-(methylsu...)
Affinity DataIC50:  19nM. Assay description: p38 MAPKγ: The inhibitory activities of compounds of the invention against p38MAPKγ (MAPK12: Invitrogen), are evaluated in a similar fashio...
Ligand InfoPC cidPC sid
In DepthDetails US Patent