BDBM299092 (+/-)-N-(5-bromo-3-hydroxypyrazin-2-yl)-1-(3,5-dichlorophenyl)-2,2,2-trifluoroethane-1-sulfonamide::US10125125, Example 141
SMILES Oc1nc(Br)cnc1NS(=O)(=O)C(c1cc(Cl)cc(Cl)c1)C(F)(F)F
InChI Key InChIKey=ZQBVMKBDNZGGFZ-UHFFFAOYSA-N
Data  1 IC50
  Tab Delimited (TSV)   2D SDfile   Computed 3D by Vconf -m prep SDfile
Find this compound or compounds like it in BindingDB:
Activity Spreadsheet -- Enzyme Inhibition Constant Data from BindingDB
Found 1 hit for monomerid = 299092
TargetProtein S100-A9(Homo sapiens (Human))
Active Biotech
US Patent
LigandPNGBDBM299092((+/-)-N-(5-bromo-3-hydroxypyrazin-2-yl)-1-(3,5-dic...)
Affinity DataIC50: <1.00E+3nM. Assay description: Incubation of Biot-hS100A9+Compound Samples and rhRAGE-Fc-Acceptor Beads in OptiplateWhen the biot-hS100A9+ compound incubation is finished the solut...
Ligand InfoPC cidPC sid
In DepthDetails US Patent