BDBM299105 N-(6-chloro-2-hydroxypyridin-3-yl)-4-propylbenzene-1-sulfonamide::US10125125, Example 179
SMILES CCCc1ccc(cc1)S(=O)(=O)Nc1ccc(Cl)nc1O
InChI Key InChIKey=MXRZSJRXWPRJSZ-UHFFFAOYSA-N
Data  1 IC50
  Tab Delimited (TSV)   2D SDfile   Computed 3D by Vconf -m prep SDfile
Find this compound or compounds like it in BindingDB:
Activity Spreadsheet -- Enzyme Inhibition Constant Data from BindingDB
Found 1 hit for monomerid = 299105
TargetProtein S100-A9(Homo sapiens (Human))
Active Biotech
US Patent
LigandPNGBDBM299105(N-(6-chloro-2-hydroxypyridin-3-yl)-4-propylbenzene...)
Affinity DataIC50: <1.00E+3nM. Assay description: Incubation of Biot-hS100A9+Compound Samples and rhRAGE-Fc-Acceptor Beads in OptiplateWhen the biot-hS100A9+ compound incubation is finished the solut...
Ligand InfoPC cidPC sid
In DepthDetails US Patent