BDBM30701 2-(1H-indol-3-yl)-N-methyl-ethanamine::2-(1H-indol-3-yl)-N-methylethanamine::2-(1H-indol-3-yl)ethyl-methyl-amine::MLS000069493::N-OMEGA-METHYLTRYPTAMINE::N-methyltryptamine::SMR000059062::cid_6088
SMILES CNCCc1c[nH]c2ccccc12
InChI Key InChIKey=NCIKQJBVUNUXLW-UHFFFAOYSA-N
Data  1 KI  1 Kd  8 EC50
PDB links: 1 PDB ID matches this monomer.
  Tab Delimited (TSV)   2D SDfile   Computed 3D by Vconf -m prep SDfile
Find this compound or compounds like it in BindingDB:
Activity Spreadsheet -- Enzyme Inhibition Constant Data from BindingDB
Found 10 hits for monomerid = 30701
Target5-hydroxytryptamine receptor 6(RAT)
National Institute Of Neurological Disorders And Stroke
Curated by PDSP Ki Database
LigandPNGBDBM30701(2-(1H-indol-3-yl)-N-methyl-ethanamine | 2-(1H-indo...)
Affinity DataKi:  342nM
In DepthDetails PubMed
Target5-hydroxytryptamine receptor 1E(Homo sapiens (Human))
The Scripps Research Institute Molecular Screening Center
Curated by PubChem BioAssay
LigandPNGBDBM30701(2-(1H-indol-3-yl)-N-methyl-ethanamine | 2-(1H-indo...)
Affinity DataEC50:  105nMpH: 7.4 T: 2°C. Assay description: The CHO cell line was cultured in T-175 sq cm Corning flasks (part 431080) at 37 deg C and 95% RH. The HTS assay began by dispensing 10 microliters o...
In DepthDetails PCBioAssay
Target5-hydroxytryptamine receptor 1A(Homo sapiens (Human))
The Scripps Research Institute Molecular Screening Center
Curated by PubChem BioAssay
LigandPNGBDBM30701(2-(1H-indol-3-yl)-N-methyl-ethanamine | 2-(1H-indo...)
Affinity DataEC50:  9.90E+4nMpH: 7.4 T: 2°C. Assay description: A cell line containing the human 5-HT1a receptor, the promiscuous G-alpha-15 protein (Ga15) as well as the beta-lactamase (BLA) reporter-gene under c...
In DepthDetails PCBioAssay
TargetSphingosine 1-phosphate receptor 3(Homo sapiens (Human))
The Scripps Research Institute Molecular Screening Center
Curated by PubChem BioAssay
LigandPNGBDBM30701(2-(1H-indol-3-yl)-N-methyl-ethanamine | 2-(1H-indo...)
Affinity DataEC50: >4.00E+4nM. Assay description: External Assay ID: S1P3_EC50_CS_5HT1e_Agonist Name: S1P3 Dose Response Assay Counterscreen for 5-Hydroxytryptamine(Serotonin) Receptor Subtype 1E ...
In DepthDetails PCBioAssay
Target5-hydroxytryptamine receptor 2B(RAT)
TBA
Curated by ChEMBL
LigandPNGBDBM30701(2-(1H-indol-3-yl)-N-methyl-ethanamine | 2-(1H-indo...)
Affinity DataKd:  1.07E+3nM. Assay description: The binding affinity to 5-hydroxytryptamine 2B receptor of rat fundus
In DepthDetails ArticlePubMed
Target5-hydroxytryptamine receptor 1A(Homo sapiens (Human))
The Scripps Research Institute Molecular Screening Center
Curated by PubChem BioAssay
LigandPNGBDBM30701(2-(1H-indol-3-yl)-N-methyl-ethanamine | 2-(1H-indo...)
Affinity DataEC50:  5.10E+3nMpH: 7.4 T: 2°C. Assay description: A cell line containing the human 5-HT1a receptor, the promiscuous G-alpha-15 protein (Ga15) as well as the beta-lactamase (BLA) reporter-gene under c...
In DepthDetails PCBioAssay
TargetTransporter(Rattus norvegicus)
Research Triangle Institute
Curated by ChEMBL
LigandPNGBDBM30701(2-(1H-indol-3-yl)-N-methyl-ethanamine | 2-(1H-indo...)
Affinity DataEC50:  733nM. Assay description: Induction of NET-mediated norepinephrine release in rat brain synaptosomes by [3H]NE release assay
In DepthDetails ArticlePubMed
TargetSodium-dependent dopamine transporter(Rattus norvegicus (rat))
Research Triangle Institute
Curated by ChEMBL
LigandPNGBDBM30701(2-(1H-indol-3-yl)-N-methyl-ethanamine | 2-(1H-indo...)
Affinity DataEC50:  321nM. Assay description: Induction of DAT-mediated dopamine release in rat brain synaptosomes by [3H]DA release assay
In DepthDetails ArticlePubMed
Target5-hydroxytryptamine receptor 2A(Homo sapiens (Human))
Research Triangle Institute
Curated by ChEMBL
LigandPNGBDBM30701(2-(1H-indol-3-yl)-N-methyl-ethanamine | 2-(1H-indo...)
Affinity DataEC50:  51nM. Assay description: Agonist activity at 5HT2A receptor (unknown origin) by cell based calcium mobilization assay
In DepthDetails ArticlePubMed
TargetSodium-dependent serotonin transporter(Rattus norvegicus (rat))
Research Triangle Institute
Curated by ChEMBL
LigandPNGBDBM30701(2-(1H-indol-3-yl)-N-methyl-ethanamine | 2-(1H-indo...)
Affinity DataEC50:  22nM. Assay description: Induction of 5-HTT-mediated 5-HT release in rat brain synaptosomes by [3H]5-HT release assay
In DepthDetails ArticlePubMed