BDBM3073 2-aminopyrido[2,3-d]pyrimidin-7(8H)-one 40::6-(2,6-Dichlorophenyl)-8-methyl-2-(pyridin-3-ylamino)-8H-pyrido[2,3-d]pyrimidin-7-one::6-(2,6-dichlorophenyl)-8-methyl-2-(pyridin-3-ylamino)-7H,8H-pyrido[2,3-d]pyrimidin-7-one::PD 166285 analog
SMILES Cn1c2nc(Nc3cccnc3)ncc2cc(-c2c(Cl)cccc2Cl)c1=O
InChI Key InChIKey=SJHLMHPRVRNIFW-UHFFFAOYSA-N
Data  4 IC50
  Tab Delimited (TSV)   2D SDfile   Computed 3D by Vconf -m prep SDfile
Find this compound or compounds like it in BindingDB:
Activity Spreadsheet -- Enzyme Inhibition Constant Data from BindingDB
Found 4 hits for monomerid = 3073
TargetPlatelet-derived growth factor receptor beta(Homo sapiens (Human))
Parke-Davis Pharmaceutical Research
LigandPNGBDBM3073(2-aminopyrido[2,3-d]pyrimidin-7(8H)-one 40 | 6-(2,...)
Affinity DataIC50:  120nM. Assay description: IC50 is the inhibitor concentration which inhibits 50% of kinase activity that catalyzes the transfer of the terminal phosphate from [gamma-32P] labe...
In DepthDetails ArticlePubMed
TargetEpidermal growth factor receptor(Homo sapiens (Human))
Parke-Davis Pharmaceutical Research
LigandPNGBDBM3073(2-aminopyrido[2,3-d]pyrimidin-7(8H)-one 40 | 6-(2,...)
Affinity DataIC50:  510nM. Assay description: IC50 is the inhibitor concentration which inhibits 50% of kinase activity that catalyzes the transfer of the terminal phosphate from [gamma-32P] labe...
In DepthDetails ArticlePubMed
TargetProto-oncogene tyrosine-protein kinase Src(Homo sapiens (Human))
Parke-Davis Pharmaceutical Research
LigandPNGBDBM3073(2-aminopyrido[2,3-d]pyrimidin-7(8H)-one 40 | 6-(2,...)
Affinity DataIC50:  38nM. Assay description: IC50 is the inhibitor concentration which inhibits 50% of kinase activity that catalyzes the transfer of the terminal phosphate from [gamma-32P] labe...
In DepthDetails ArticlePubMed
TargetFibroblast growth factor receptor 1(Homo sapiens (Human))
Parke-Davis Pharmaceutical Research
LigandPNGBDBM3073(2-aminopyrido[2,3-d]pyrimidin-7(8H)-one 40 | 6-(2,...)
Affinity DataIC50:  150nM. Assay description: IC50 is the inhibitor concentration which inhibits 50% of kinase activity that catalyzes the transfer of the terminal phosphate from [gamma-32P] labe...
In DepthDetails ArticlePubMed