BDBM30774 2-azanylidene-N-[(4-fluorophenyl)methyl]-1-(3-morpholin-4-ylpropyl)-5-oxidanylidene-dipyrido[1,2-d:3',4'-f]pyrimidine-3-carboxamide::MLS000040310::N-(4-fluorobenzyl)-2-imino-5-keto-1-(3-morpholinopropyl)dipyrido[1,2-d:3',4'-f]pyrimidine-3-carboxamide::N-[(4-fluorophenyl)methyl]-2-imino-1-(3-morpholin-4-ylpropyl)-5-oxodipyrido[1,2-d:3',4'-f]pyrimidine-3-carboxamide::N-[(4-fluorophenyl)methyl]-2-imino-1-[3-(4-morpholinyl)propyl]-5-oxo-3-dipyrido[1,2-d:3',4'-f]pyrimidinecarboxamide::SMR000045218::cid_664382
SMILES Fc1ccc(CNC(=O)c2cc3c(nc4ccccn4c3=O)n(CCCN3CCOCC3)c2=N)cc1
InChI Key InChIKey=HDMQZNJNKFOYBR-UHFFFAOYSA-N
Data  1 EC50
  Tab Delimited (TSV)   2D SDfile   Computed 3D by Vconf -m prep SDfile
Find this compound or compounds like it in BindingDB:
Activity Spreadsheet -- Enzyme Inhibition Constant Data from BindingDB
Found 1 hit for monomerid = 30774
Target5-hydroxytryptamine receptor 1A(Homo sapiens (Human))
The Scripps Research Institute Molecular Screening Center
Curated by PubChem BioAssay
LigandPNGBDBM30774(2-azanylidene-N-[(4-fluorophenyl)methyl]-1-(3-morp...)
Affinity DataEC50:  3.30E+4nMpH: 7.4 T: 2°C. Assay description: A cell line containing the human 5-HT1a receptor, the promiscuous G-alpha-15 protein (Ga15) as well as the beta-lactamase (BLA) reporter-gene under c...
In DepthDetails PCBioAssay