BDBM308193 US9649309, Compound UNC2571A
SMILES CCCCNc1ncc(c(NC2CC[C@H](O)CC2)n1)-c1ccc(CNCc2ccncc2)cn1
InChI Key InChIKey=IADRGGYOCXDICI-RAKDUWMASA-N
Data  5 IC50
  Tab Delimited (TSV)   2D SDfile   Computed 3D by Vconf -m prep SDfile
Find this compound or compounds like it in BindingDB:
Activity Spreadsheet -- Enzyme Inhibition Constant Data from BindingDB
Found 5 hits for monomerid = 308193
TargetReceptor-type tyrosine-protein kinase FLT3(Homo sapiens (Human))
University Of North Carolina At Chapel Hill
US Patent
LigandPNGBDBM308193(US9649309, Compound UNC2571A)
Affinity DataIC50:  3.20nM. Assay description: Briefly, activity assays were performed in a 384 well, polypropylene microplate in a final volume of 50 μL of 50 mM Hepes, Ph 7.4 containing 10 ...
Ligand InfoPC cidPC sid
In DepthDetails US Patent
TargetTyrosine-protein kinase Mer(Homo sapiens (Human))
University Of North Carolina At Chapel Hill
US Patent
LigandPNGBDBM308193(US9649309, Compound UNC2571A)
Affinity DataIC50:  0.470nM. Assay description: Briefly, activity assays were performed in a 384 well, polypropylene microplate in a final volume of 50 μL of 50 mM Hepes, Ph 7.4 containing 10 ...
Ligand InfoPC cidPC sid
In DepthDetails US Patent
TargetTyrosine-protein kinase Mer(Homo sapiens (Human))
University Of North Carolina At Chapel Hill
US Patent
LigandPNGBDBM308193(US9649309, Compound UNC2571A)
Affinity DataIC50: <10nM. Assay description: Briefly, activity assays were performed in a 384 well, polypropylene microplate in a final volume of 50 μL of 50 mM Hepes, Ph 7.4 containing 10 ...
Ligand InfoPC cidPC sid
In DepthDetails US Patent
TargetTyrosine-protein kinase receptor TYRO3(Homo sapiens (Human))
University Of North Carolina At Chapel Hill
US Patent
LigandPNGBDBM308193(US9649309, Compound UNC2571A)
Affinity DataIC50:  44nM. Assay description: Briefly, activity assays were performed in a 384 well, polypropylene microplate in a final volume of 50 μL of 50 mM Hepes, Ph 7.4 containing 10 ...
Ligand InfoPC cidPC sid
In DepthDetails US Patent
TargetGrowth arrest-specific protein 6(Homo sapiens (Human))
University Of North Carolina At Chapel Hill
US Patent
LigandPNGBDBM308193(US9649309, Compound UNC2571A)
Affinity DataIC50:  18nM. Assay description: Briefly, activity assays were performed in a 384 well, polypropylene microplate in a final volume of 50 μL of 50 mM Hepes, Ph 7.4 containing 10 ...
Ligand InfoPC cidPC sid
In DepthDetails US Patent