BDBM30839 1-(3-chlorobenzyl)-2-imidazolidinone::1-(3-chlorobenzyl)imidazolidin-2-one::1-[(3-chlorophenyl)methyl]-2-imidazolidinone::1-[(3-chlorophenyl)methyl]imidazolidin-2-one::MLS000095781::SMR000031329::cid_3235606
SMILES Clc1cccc(CN2CCNC2=O)c1
InChI Key InChIKey=BWBAZKSTBCFLBK-UHFFFAOYSA-N
Data  1 EC50
  Tab Delimited (TSV)   2D SDfile   Computed 3D by Vconf -m prep SDfile
Find this compound or compounds like it in BindingDB:
Activity Spreadsheet -- Enzyme Inhibition Constant Data from BindingDB
Found 1 hit for monomerid = 30839
Target5-hydroxytryptamine receptor 1A(Homo sapiens (Human))
The Scripps Research Institute Molecular Screening Center
Curated by PubChem BioAssay
LigandPNGBDBM30839(1-(3-chlorobenzyl)-2-imidazolidinone | 1-(3-chloro...)
Affinity DataEC50:  9.90E+4nMpH: 7.4 T: 2°C. Assay description: A cell line containing the human 5-HT1a receptor, the promiscuous G-alpha-15 protein (Ga15) as well as the beta-lactamase (BLA) reporter-gene under c...
In DepthDetails PCBioAssay