BDBM309109 Trans-N-(3,4-difluorobenzyl)-4-(4-fluorophenyl)-1-[(1-methyl-1H-imidazol-4-yl)sulfonyl]pyrrolidine-3-carboxamide::US9656955, Example 631
SMILES Cn1cnc(c1)S(=O)(=O)N1C[C@H]([C@@H](C1)c1ccc(F)cc1)C(=O)NCc1ccc(F)c(F)c1
InChI Key InChIKey=IXNBDFDLHCIQKU-ZWKOTPCHSA-N
Data  1 KI
  Tab Delimited (TSV)   2D SDfile   Computed 3D by Vconf -m prep SDfile
Find this compound or compounds like it in BindingDB:
Activity Spreadsheet -- Enzyme Inhibition Constant Data from BindingDB
Found 1 hit for monomerid = 309109
LigandPNGBDBM309109(Trans-N-(3,4-difluorobenzyl)-4-(4-fluorophenyl)-1-...)
Affinity DataKi: <10nM. Assay description: Radioligand binding assays using recombinant CHO cell membranes expressing human GlyT1: Radioligand binding to human GlyT1c transporter-expressing me...
Ligand InfoPC cidPC sid
In DepthDetails US Patent