BDBM309282 5-chloro-N-{(3R,4S)-4-(4-fluorophenyl)-1-[(1-methyl-1H-imidazol-4-yl)sulfonyl]pyrrolidin-3-yl}-4-(2,2,2-trifluoroethoxy)pyridin-2-amine::US9656955, Example 806
SMILES Cn1cnc(c1)S(=O)(=O)N1C[C@H](Nc2cc(OCC(F)(F)F)c(Cl)cn2)[C@H](C1)c1ccc(F)cc1
InChI Key InChIKey=HXFAWQJRPUXADU-WBVHZDCISA-N
Data  1 KI
  Tab Delimited (TSV)   2D SDfile   Computed 3D by Vconf -m prep SDfile
Find this compound or compounds like it in BindingDB:
Activity Spreadsheet -- Enzyme Inhibition Constant Data from BindingDB
Found 1 hit for monomerid = 309282
LigandPNGBDBM309282(5-chloro-N-{(3R,4S)-4-(4-fluorophenyl)-1-[(1-methy...)
Affinity DataKi: <10nM. Assay description: Radioligand binding assays using recombinant CHO cell membranes expressing human GlyT1: Radioligand binding to human GlyT1c transporter-expressing me...
Ligand InfoPC cidPC sid
In DepthDetails US Patent