BDBM309314 (3R,4S)-4-(4-fluorophenyl)-1-[(1-methyl-1H-1,2,3-triazol-4-yl)sulfonyl]-N-[3-(trifluoromethyl)phenyl]pyrrolidin-3-amine::US9656955, Example 839
SMILES Cn1cc(nn1)S(=O)(=O)N1C[C@H](Nc2cccc(c2)C(F)(F)F)[C@H](C1)c1ccc(F)cc1
InChI Key InChIKey=USFKPDRZPFPFBV-MSOLQXFVSA-N
Data  1 KI
  Tab Delimited (TSV)   2D SDfile   Computed 3D by Vconf -m prep SDfile
Find this compound or compounds like it in BindingDB:
Activity Spreadsheet -- Enzyme Inhibition Constant Data from BindingDB
Found 1 hit for monomerid = 309314
LigandPNGBDBM309314((3R,4S)-4-(4-fluorophenyl)-1-[(1-methyl-1H-1,2,3-t...)
Affinity DataKi: <10nM. Assay description: Radioligand binding assays using recombinant CHO cell membranes expressing human GlyT1: Radioligand binding to human GlyT1c transporter-expressing me...
Ligand InfoPC cidPC sid
In DepthDetails US Patent