BDBM30943 MLS000118105::N-[3-[4-(3-chlorophenyl)-1-piperazinyl]propyl]-1,5-dimethyl-4-oxo-2-pyrrolo[3,2-c]quinolinecarboxamide::N-[3-[4-(3-chlorophenyl)piperazin-1-yl]propyl]-1,5-dimethyl-4-oxidanylidene-pyrrolo[3,2-c]quinoline-2-carboxamide::N-[3-[4-(3-chlorophenyl)piperazin-1-yl]propyl]-1,5-dimethyl-4-oxopyrrolo[3,2-c]quinoline-2-carboxamide::N-[3-[4-(3-chlorophenyl)piperazino]propyl]-4-keto-1,5-dimethyl-pyrrolo[3,2-c]quinoline-2-carboxamide::SMR000095053::cid_5308205
SMILES Cn1c(cc2c1c1ccccc1n(C)c2=O)C(=O)NCCCN1CCN(CC1)c1cccc(Cl)c1
InChI Key InChIKey=FOQIDWRIGLTMJC-UHFFFAOYSA-N
Data  3 IC50  1 EC50
  Tab Delimited (TSV)   2D SDfile   Computed 3D by Vconf -m prep SDfile
Find this compound or compounds like it in BindingDB:
Activity Spreadsheet -- Enzyme Inhibition Constant Data from BindingDB
Found 4 hits for monomerid = 30943
Target5-hydroxytryptamine receptor 1A(Homo sapiens (Human))
The Scripps Research Institute Molecular Screening Center
Curated by PubChem BioAssay
LigandPNGBDBM30943(MLS000118105 | N-[3-[4-(3-chlorophenyl)-1-piperazi...)
Affinity DataEC50:  9.90E+4nMpH: 7.4 T: 2°C. Assay description: A cell line containing the human 5-HT1a receptor, the promiscuous G-alpha-15 protein (Ga15) as well as the beta-lactamase (BLA) reporter-gene under c...
In DepthDetails PCBioAssay
TargetUbiquitin-conjugating enzyme E2 N(Homo sapiens (Human))
Burnham Center For Chemical Genomics
Curated by PubChem BioAssay
LigandPNGBDBM30943(MLS000118105 | N-[3-[4-(3-chlorophenyl)-1-piperazi...)
Affinity DataIC50: >2.00E+4nM. Assay description: Data Source: Sanford-Burnham Center for Chemical Genomics (SBCCG) Source Affiliation: Sanford-Burnham Medical Research Institute (SBMRI, San Diego CA...
In DepthDetails PCBioAssay
TargetProcathepsin L(Homo sapiens (Human))
Pcmd
Curated by PubChem BioAssay
LigandPNGBDBM30943(MLS000118105 | N-[3-[4-(3-chlorophenyl)-1-piperazi...)
Affinity DataIC50: >5.00E+4nM. Assay description: Screening Center: Penn Center for Molecular Discovery Center Affiliation: University of Pennsylvania Network: Molecular Library Screening Center Netw...
In DepthDetails PCBioAssay
TargetCathepsin S(Homo sapiens (Human))
Pcmd
Curated by PubChem BioAssay
LigandPNGBDBM30943(MLS000118105 | N-[3-[4-(3-chlorophenyl)-1-piperazi...)
Affinity DataIC50:  2.74E+4nM. Assay description: Screening Center: Penn Center for Molecular Discovery Center Affiliation: University of Pennsylvania Network: Molecular Library Screening Center Netw...
In DepthDetails PCBioAssay