BDBM31000 1-(phenylmethyl)-3-(1-pyrrolidin-1-ylcarbonylcyclohexyl)urea::1-Benzyl-3-[1-(pyrrolidine-1-carbonyl)-cyclohexyl]-urea::1-[1-[oxo(1-pyrrolidinyl)methyl]cyclohexyl]-3-(phenylmethyl)urea::1-benzyl-3-[1-(pyrrolidine-1-carbonyl)cyclohexyl]urea::MLS000029966::SMR000000429::cid_647179
SMILES O=C(NCc1ccccc1)NC1(CCCCC1)C(=O)N1CCCC1
InChI Key InChIKey=MAOPJHOUQJUPDK-UHFFFAOYSA-N
Data  3 EC50
  Tab Delimited (TSV)   2D SDfile   Computed 3D by Vconf -m prep SDfile
Find this compound or compounds like it in BindingDB:
Activity Spreadsheet -- Enzyme Inhibition Constant Data from BindingDB
Found 3 hits for monomerid = 31000
Target5-hydroxytryptamine receptor 1A(Homo sapiens (Human))
The Scripps Research Institute Molecular Screening Center
Curated by PubChem BioAssay
LigandPNGBDBM31000(1-(phenylmethyl)-3-(1-pyrrolidin-1-ylcarbonylcyclo...)
Affinity DataEC50:  5.00E+4nMpH: 7.4 T: 2°C. Assay description: A cell line containing the human 5-HT1a receptor, the promiscuous G-alpha-15 protein (Ga15) as well as the beta-lactamase (BLA) reporter-gene under c...
In DepthDetails PCBioAssay
TargetSphingosine 1-phosphate receptor 3(Homo sapiens (Human))
The Scripps Research Institute Molecular Screening Center
Curated by PubChem BioAssay
LigandPNGBDBM31000(1-(phenylmethyl)-3-(1-pyrrolidin-1-ylcarbonylcyclo...)
Affinity DataEC50: >4.00E+4nM. Assay description: External Assay ID: S1P3_EC50_CS_5HT1e_Agonist Name: S1P3 Dose Response Assay Counterscreen for 5-Hydroxytryptamine(Serotonin) Receptor Subtype 1E ...
In DepthDetails PCBioAssay
Target5-hydroxytryptamine receptor 1E(Homo sapiens (Human))
The Scripps Research Institute Molecular Screening Center
Curated by PubChem BioAssay
LigandPNGBDBM31000(1-(phenylmethyl)-3-(1-pyrrolidin-1-ylcarbonylcyclo...)
Affinity DataEC50:  5.00E+4nMpH: 7.4 T: 2°C. Assay description: The CHO cell line was cultured in T-175 sq cm Corning flasks (part 431080) at 37 deg C and 95% RH. The HTS assay began by dispensing 10 microliters o...
In DepthDetails PCBioAssay