BDBM311673 Ex. Cpd. 125::US10807986, Example 125::US11046696, Compound 125
SMILES COCc1ccc(NC(=O)c2c(C#CCC3(O)COC3)n(c3ncnc(N)c23)C2(C)CC2)cc1
InChI Key InChIKey=PXRSYMQJEFVWML-UHFFFAOYSA-N
Data  9 IC50
  Tab Delimited (TSV)   2D SDfile   Computed 3D by Vconf -m prep SDfile
Find this compound or compounds like it in BindingDB:
Activity Spreadsheet -- Enzyme Inhibition Constant Data from BindingDB
Found 9 hits for monomerid = 311673
TargetProto-oncogene tyrosine-protein kinase receptor Ret(Homo sapiens (Human))
Taiho Pharmaceutical
US Patent
LigandPNGBDBM311673(Ex. Cpd. 125 | US10807986, Example 125 | US1104669...)
Affinity DataIC50:  0.200nM. Assay description: Regarding the conditions for measurement of in vitro inhibitory activity of compounds against RET kinase activity, the website of AnaSpec states that...
Ligand InfoPC cidPC sid
In DepthDetails US Patent
TargetProto-oncogene tyrosine-protein kinase receptor Ret [V804L](Homo sapiens (Human))
Taiho Pharmaceutical
US Patent
LigandPNGBDBM311673(Ex. Cpd. 125 | US10807986, Example 125 | US1104669...)
Affinity DataIC50:  0.600nM. Assay description: Regarding the conditions for measurement of in vitro inhibitory activity of compounds against RET (V804L) (i.e., RET with V804L mutation) kinase acti...
Ligand InfoPC cidPC sid
In DepthDetails US Patent
TargetProto-oncogene tyrosine-protein kinase receptor Ret [V804M](Homo sapiens (Human))
Taiho Pharmaceutical
US Patent
LigandPNGBDBM311673(Ex. Cpd. 125 | US10807986, Example 125 | US1104669...)
Affinity DataIC50:  2.5nM. Assay description: RET (V804M) (i.e., RET with V804M mutation) kinase activity was measured using purified recombinant human RET (V804M) protein purchased from Eurofins...
Ligand InfoPC cidPC sid
In DepthDetails US Patent
TargetProto-oncogene tyrosine-protein kinase receptor Ret(Homo sapiens (Human))
Taiho Pharmaceutical
US Patent
LigandPNGBDBM311673(Ex. Cpd. 125 | US10807986, Example 125 | US1104669...)
Affinity DataIC50:  0.200nM. Assay description: Regarding the conditions for measurement of in vitro inhibitory activity of compounds against RET kinase activity, the website of AnaSpec states that...
Ligand InfoPC cidPC sid
In DepthDetails US Patent
TargetProto-oncogene tyrosine-protein kinase receptor Ret [V804L](Homo sapiens (Human))
Taiho Pharmaceutical
US Patent
LigandPNGBDBM311673(Ex. Cpd. 125 | US10807986, Example 125 | US1104669...)
Affinity DataIC50:  2.5nM. Assay description: Regarding the conditions for measurement of in vitro inhibitory activity of compounds against RET kinase activity, the website of AnaSpec states that...
Ligand InfoPC cidPC sid
In DepthDetails US Patent
TargetProto-oncogene tyrosine-protein kinase receptor Ret [V804M](Homo sapiens (Human))
Taiho Pharmaceutical
US Patent
LigandPNGBDBM311673(Ex. Cpd. 125 | US10807986, Example 125 | US1104669...)
Affinity DataIC50:  2.5nM. Assay description: Regarding the conditions for measurement of in vitro inhibitory activity of compounds against RET (V804L or V804M) (i.e., RET with V804L or V804M mut...
Ligand InfoPC cidPC sid
In DepthDetails US Patent
TargetProto-oncogene tyrosine-protein kinase receptor Ret(Homo sapiens (Human))
Taiho Pharmaceutical
US Patent
LigandPNGBDBM311673(Ex. Cpd. 125 | US10807986, Example 125 | US1104669...)
Affinity DataIC50:  0.200nM. Assay description: Regarding the conditions for measurement of in vitro inhibitory activity of compounds against RET kinase activity, the website of AnaSpec states that...
Ligand InfoPC cidPC sid
In DepthDetails US Patent
TargetProto-oncogene tyrosine-protein kinase receptor Ret [V804M](Homo sapiens (Human))
Taiho Pharmaceutical
US Patent
LigandPNGBDBM311673(Ex. Cpd. 125 | US10807986, Example 125 | US1104669...)
Affinity DataIC50:  0.600nM. Assay description: Regarding the conditions for measurement of in vitro inhibitory activity of compounds against RET kinase activity, the website of AnaSpec states that...
Ligand InfoPC cidPC sid
In DepthDetails US Patent
TargetProto-oncogene tyrosine-protein kinase receptor Ret [V804L](Homo sapiens (Human))
Taiho Pharmaceutical
US Patent
LigandPNGBDBM311673(Ex. Cpd. 125 | US10807986, Example 125 | US1104669...)
Affinity DataIC50:  0.600nM. Assay description: Regarding the conditions for measurement of in vitro inhibitory activity of compounds against RET (V804L or V804M) (i.e., RET with V804L or V804M mut...
Ligand InfoPC cidPC sid
In DepthDetails US Patent