BDBM31219 2-phenoxybenzoyltryptophan derivative, R4C1
SMILES OC(=O)[C@H](Cc1c[nH]c2ccc(cc12)C#N)NC(=O)c1ccccc1Oc1ccccc1
InChI Key InChIKey=RNMJHKQPDFCCQA-QFIPXVFZSA-N
Data  1 KI
  Tab Delimited (TSV)   2D SDfile   Computed 3D by Vconf -m prep SDfile
Find this compound or compounds like it in BindingDB:
Activity Spreadsheet -- Enzyme Inhibition Constant Data from BindingDB
Found 1 hit for monomerid = 31219
TargetE3 ubiquitin-protein ligase Mdm2(Homo sapiens (Human))
Schering-Plough Research Institute
LigandPNGBDBM31219(2-phenoxybenzoyltryptophan derivative, R4C1)
Affinity DataKi:  1.00E+4nM ΔG°:  -6.77kcal/molepH: 7.4 T: 2°C. Assay description: Ki values were determined from a competition experiment in which serial dilutions of inhibitor were added to compete against a fixed concentration (1...
In DepthDetails ArticlePubMed