BDBM31692 4-[(1-tert-butyl-1,2,3,4-tetrazol-5-yl)-quinolin-6-yl-methyl]thiomorpholine::4-[(1-tert-butyl-5-tetrazolyl)-(6-quinolinyl)methyl]thiomorpholine::4-[(1-tert-butyltetrazol-5-yl)-(6-quinolyl)methyl]thiomorpholine::4-[(1-tert-butyltetrazol-5-yl)-quinolin-6-ylmethyl]thiomorpholine::6-[(1-tert-Butyl-1H-tetrazol-5-yl)-thiomorpholin-4-yl-methyl]-quinoline::MLS000075443::SMR000003972::cid_651602
SMILES CC(C)(C)n1nnnc1C(N1CCSCC1)c1ccc2ncccc2c1
InChI Key InChIKey=NCRSITDRLINBPG-UHFFFAOYSA-N
Data  3 IC50
  Tab Delimited (TSV)   2D SDfile   Computed 3D by Vconf -m prep SDfile
Find this compound or compounds like it in BindingDB:
Activity Spreadsheet -- Enzyme Inhibition Constant Data from BindingDB
Found 3 hits for monomerid = 31692
TargetHeat shock 70 kDa protein 1A(Homo sapiens (Human))
Burnham Center For Chemical Genomics
Curated by PubChem BioAssay
LigandPNGBDBM31692(4-[(1-tert-butyl-1,2,3,4-tetrazol-5-yl)-quinolin-6...)
Affinity DataIC50:  1.00E+5nMpH: 7.0 T: 2°C. Assay description: Burnham Center for Chemical Genomics (BCCG) Burnham Institute for Medical Research (San Diego, CA) NIH Molecular Libraries Screening Centers Network ...
In DepthDetails PCBioAssay
TargetHeat shock cognate 71 kDa protein(Homo sapiens (Human))
Burnham Center For Chemical Genomics
Curated by PubChem BioAssay
LigandPNGBDBM31692(4-[(1-tert-butyl-1,2,3,4-tetrazol-5-yl)-quinolin-6...)
Affinity DataIC50:  9.99E+5nM. Assay description: Sanford-Burnham Center for Chemical Genomics (SBCCG) Sanford-Burnham Medical Research Institute (San Diego, CA) NIH Molecular Libraries Screening Cen...
In DepthDetails PCBioAssay
TargetHeat shock 70 kDa protein 1A(Homo sapiens (Human))
Burnham Center For Chemical Genomics
Curated by PubChem BioAssay
LigandPNGBDBM31692(4-[(1-tert-butyl-1,2,3,4-tetrazol-5-yl)-quinolin-6...)
Affinity DataIC50: >1.00E+5nM. Assay description: Sanford-Burnham Center for Chemical Genomics (SBCCG) Sanford-Burnham Medical Research Institute (San Diego, CA) NIH Molecular Libraries Screening Cen...
In DepthDetails PCBioAssay