BDBM31726 1,6-bis(chloranyl)-7-methyl-2-(2-nitrophenyl)sulfanyl-2,3,3a,4,5,9b-hexahydro-1H-cyclopenta[c]quinoline-4-carboxylic acid::1,6-dichloro-7-methyl-2-(2-nitrophenyl)sulfanyl-2,3,3a,4,5,9b-hexahydro-1H-cyclopenta[c]quinoline-4-carboxylic acid::1,6-dichloro-7-methyl-2-[(2-nitrophenyl)thio]-2,3,3a,4,5,9b-hexahydro-1H-cyclopenta[c]quinoline-4-carboxylic acid::MLS-0111572.0001::cid_3124366
SMILES Cc1ccc2C3C(Cl)C(CC3C(Nc2c1Cl)C(O)=O)Sc1ccccc1[N+]([O-])=O
InChI Key InChIKey=YCLFNFMIGLHWRQ-UHFFFAOYSA-N
Data  5 IC50
  Tab Delimited (TSV)   2D SDfile   Computed 3D by Vconf -m prep SDfile
Find this compound or compounds like it in BindingDB:
Activity Spreadsheet -- Enzyme Inhibition Constant Data from BindingDB
Found 5 hits for monomerid = 31726
TargetDual specificity protein phosphatase 6(Rattus norvegicus)
Burnham Center For Chemical Genomics
Curated by PubChem BioAssay
LigandPNGBDBM31726(1,6-bis(chloranyl)-7-methyl-2-(2-nitrophenyl)sulfa...)
Affinity DataIC50:  4.26E+4nMpH: 7.0 T: 2°C. Assay description: Data Source: Burnham Center for Chemical Genomics (BCCG) Source Affiliation: Burnham Institute for Medical Research (BIMR, La Jolla, CA) Network: NIH...
In DepthDetails PCBioAssay
TargetDual specificity protein phosphatase 6(Rattus norvegicus)
Burnham Center For Chemical Genomics
Curated by PubChem BioAssay
LigandPNGBDBM31726(1,6-bis(chloranyl)-7-methyl-2-(2-nitrophenyl)sulfa...)
Affinity DataIC50:  4.26E+4nM. Assay description: Data Source: Sanford-Burnham Center for Chemical Genomics (SBCCG) Source Affiliation: Sanford-Burnham Medical Research Institute(SBMRI, San Diego, CA...
In DepthDetails PCBioAssay
TargetCarboxy-terminal domain RNA polymerase II polypeptide A small phosphatase 1(Homo sapiens (Human))
Burnham Center For Chemical Genomics
Curated by PubChem BioAssay
LigandPNGBDBM31726(1,6-bis(chloranyl)-7-methyl-2-(2-nitrophenyl)sulfa...)
Affinity DataIC50:  2.97E+3nM. Assay description: Data Source: Sanford-Burnham Center for Chemical Genomics (SBCCG) Source Affiliation: Sanford-Burnham Medical Research Institute (SBMRI, San Diego, C...
In DepthDetails PCBioAssay
TargetInduced myeloid leukemia cell differentiation protein Mcl-1(Homo sapiens (Human))
Emory University
Curated by PubChem BioAssay
LigandPNGBDBM31726(1,6-bis(chloranyl)-7-methyl-2-(2-nitrophenyl)sulfa...)
Affinity DataIC50:  2.96E+3nM. Assay description: NIH Molecular Libraries Screening Centers Network [MLSCN] Emory Chemical Biology Discovery Center in MLSCN Assay provider: Nikolovska-Coleska, Univer...
In DepthDetails PCBioAssay
TargetTyrosine-protein phosphatase non-receptor type 7(Homo sapiens (Human))
Burnham Center For Chemical Genomics
Curated by PubChem BioAssay
LigandPNGBDBM31726(1,6-bis(chloranyl)-7-methyl-2-(2-nitrophenyl)sulfa...)
Affinity DataIC50:  3.25E+4nM. Assay description: Data Source: Sanford-Burnham Center for Chemical Genomics (SBCCG) Source Affiliation: Sanford-Burnham Medical Research Institute (SBMRI, San Diego, C...
In DepthDetails PCBioAssay