BDBM32149 4-fluoranyl-N-(6-oxidanylquinolin-8-yl)benzenesulfonamide::4-fluoro-N-(6-hydroxy-8-quinolinyl)benzenesulfonamide::4-fluoro-N-(6-hydroxy-8-quinolyl)benzenesulfonamide::4-fluoro-N-(6-hydroxyquinolin-8-yl)benzenesulfonamide::TG2-97-3-2::cid_16072243
SMILES Oc1cc(NS(=O)(=O)c2ccc(F)cc2)c2ncccc2c1
InChI Key InChIKey=VIILSDIQZZYZGM-UHFFFAOYSA-N
Data  2 IC50
  Tab Delimited (TSV)   2D SDfile   Computed 3D by Vconf -m prep SDfile
Find this compound or compounds like it in BindingDB:
Activity Spreadsheet -- Enzyme Inhibition Constant Data from BindingDB
Found 2 hits for monomerid = 32149
TargetHeat shock protein HSP 90-alpha(Homo sapiens (Human))
Emory University
Curated by PubChem BioAssay
LigandPNGBDBM32149(4-fluoranyl-N-(6-oxidanylquinolin-8-yl)benzenesulf...)
Affinity DataIC50: >6.00E+4nM. Assay description: Emory Chemistry-Biology Discovery Center Assay Overview: MLSCN Grant: 1 X01MH78953-01 Hsp90 is a chaperon with important roles in maintaining transfo...
In DepthDetails PCBioAssay
TargetHeat shock protein HSP 90-alpha(Homo sapiens (Human))
Emory University
Curated by PubChem BioAssay
LigandPNGBDBM32149(4-fluoranyl-N-(6-oxidanylquinolin-8-yl)benzenesulf...)
Affinity DataIC50:  1.12E+4nMpH: 7.4 T: 2°C. Assay description: A fluorescence polarization based HTS assay has been developed and optimized for the identification of Hsp90 inhibitors by using tumor cell lysate Hs...
In DepthDetails PCBioAssay