BDBM32166 N-[4-amino-3-(5-methoxy-1,3-benzodioxol-4-yl)phenyl]-3-nitro-benzenesulfonamide::N-[4-amino-3-(5-methoxy-1,3-benzodioxol-4-yl)phenyl]-3-nitrobenzenesulfonamide::N-[4-azanyl-3-(5-methoxy-1,3-benzodioxol-4-yl)phenyl]-3-nitro-benzenesulfonamide::TG2-86-1::cid_16072260
SMILES COc1ccc2OCOc2c1-c1cc(NS(=O)(=O)c2cccc(c2)[N+]([O-])=O)ccc1N
InChI Key InChIKey=AVVYRTOLEBREDE-UHFFFAOYSA-N
Data  2 IC50
  Tab Delimited (TSV)   2D SDfile   Computed 3D by Vconf -m prep SDfile
Find this compound or compounds like it in BindingDB:
Activity Spreadsheet -- Enzyme Inhibition Constant Data from BindingDB
Found 2 hits for monomerid = 32166
TargetHeat shock protein HSP 90-alpha(Homo sapiens (Human))
Emory University
Curated by PubChem BioAssay
LigandPNGBDBM32166(N-[4-amino-3-(5-methoxy-1,3-benzodioxol-4-yl)pheny...)
Affinity DataIC50: >6.00E+4nM. Assay description: Emory Chemistry-Biology Discovery Center Assay Overview: MLSCN Grant: 1 X01MH78953-01 Hsp90 is a chaperon with important roles in maintaining transfo...
In DepthDetails PCBioAssay
TargetHeat shock protein HSP 90-alpha(Homo sapiens (Human))
Emory University
Curated by PubChem BioAssay
LigandPNGBDBM32166(N-[4-amino-3-(5-methoxy-1,3-benzodioxol-4-yl)pheny...)
Affinity DataIC50:  5.00E+4nMpH: 7.4 T: 2°C. Assay description: A fluorescence polarization based HTS assay has been developed and optimized for the identification of Hsp90 inhibitors by using tumor cell lysate Hs...
In DepthDetails PCBioAssay