BDBM32267 6,7-dimethoxy-4-(2-methoxyethylamino)-1H-quinazoline-2-thione::6,7-dimethoxy-4-[(2-methoxyethyl)amino]quinazoline-2(1H)-thione::MLS000045006::SMR000026610::cid_3239316
SMILES COCCNc1[nH]c(=S)nc2cc(OC)c(OC)cc12
InChI Key InChIKey=XMVIBURZSLZRNO-UHFFFAOYSA-N
Data  3 EC50
  Tab Delimited (TSV)   2D SDfile   Computed 3D by Vconf -m prep SDfile
Find this compound or compounds like it in BindingDB:
Activity Spreadsheet -- Enzyme Inhibition Constant Data from BindingDB
Found 3 hits for monomerid = 32267
TargetIsoform Bcl-X(L) of Bcl-2-like protein 1 (Bcl-xL)(Homo sapiens (Human))
Nmmlsc
Curated by PubChem BioAssay
LigandPNGBDBM32267(6,7-dimethoxy-4-(2-methoxyethylamino)-1H-quinazoli...)
Affinity DataEC50:  7.43E+3nMpH: 7.4 T: 2°C. Assay description: The HTS assay was conducted in 384-well microplates in a total assay volume per well of 10.1 microliters (5 microliters of bead mixture, 0.1 microlit...
In DepthDetails PCBioAssay
LigandPNGBDBM32267(6,7-dimethoxy-4-(2-methoxyethylamino)-1H-quinazoli...)
Affinity DataEC50:  4.54E+3nM. Assay description: University of New Mexico Assay Overview: Assay Support: NIH 1X01 MH079850-01 HTS to identify small molecule regulators of Bcl-2 family protein int...
In DepthDetails PCBioAssay
TargetBcl-2-like protein 2(Homo sapiens (Human))
Nmmlsc
Curated by PubChem BioAssay
LigandPNGBDBM32267(6,7-dimethoxy-4-(2-methoxyethylamino)-1H-quinazoli...)
Affinity DataEC50:  3.86E+3nM. Assay description: University of New Mexico Assay Overview: Assay Support: NIH 1X01 MH079850-01 HTS to identify small molecule regulators of Bcl-2 family protein int...
In DepthDetails PCBioAssay