BDBM327877 5-(4-(4- fluorobenzyl)piperazine- 1-carbonyl)-N-(4- phenoxyphenyl) picolinamide::US10377742, Compound 16::US9663496, Compound 16
SMILES Fc1ccc(CN2CCN(CC2)C(=O)c2ccc(nc2)C(=O)Nc2ccc(Oc3ccccc3)cc2)cc1
InChI Key InChIKey=KFWUZHLIUCMOPR-UHFFFAOYSA-N
Data  2 EC50
  Tab Delimited (TSV)   2D SDfile   Computed 3D by Vconf -m prep SDfile
Find this compound or compounds like it in BindingDB:
Activity Spreadsheet -- Enzyme Inhibition Constant Data from BindingDB
Found 2 hits for monomerid = 327877
Target5'-AMP-activated protein kinase catalytic subunit alpha-2(Homo sapiens (Human))
Rigel Pharmaceuticals
US Patent
LigandPNGBDBM327877(5-(4-(4- fluorobenzyl)piperazine- 1-carbonyl)-N-(4...)
Affinity DataEC50: <500nM. Assay description: Compounds were assayed for their ability to activate AMPK using an enzyme-linked immunosorbent assay. Reagents and procedures for measuring AMPK acti...
Ligand InfoPC cidPC sid
In DepthDetails US Patent
Target5'-AMP-activated protein kinase catalytic subunit alpha-2(Homo sapiens (Human))
Rigel Pharmaceuticals
US Patent
LigandPNGBDBM327877(5-(4-(4- fluorobenzyl)piperazine- 1-carbonyl)-N-(4...)
Affinity DataEC50: <500nM. Assay description: Compounds were assayed for their ability to activate AMPK using an enzyme-linked immunosorbent assay. Reagents and procedures for measuring AMPK acti...
Ligand InfoPC cidPC sid
In DepthDetails US Patent