BDBM33051 (4-chlorodithiazol-5-ylidene)-(3,4,5-trimethoxyphenyl)amine::4-chloranyl-N-(3,4,5-trimethoxyphenyl)-1,2,3-dithiazol-5-imine::4-chloro-N-(3,4,5-trimethoxyphenyl)-5-dithiazolimine::4-chloro-N-(3,4,5-trimethoxyphenyl)dithiazol-5-imine::MLS000090424::N-[(5Z)-4-chloro-5H-1,2,3-dithiazol-5-ylidene]-3,4,5-trimethoxyaniline::SMR000025034::cid_715715
SMILES COc1cc(cc(OC)c1OC)\N=c1\ssnc1Cl
InChI Key InChIKey=RFUGMMCRDMJZMS-ACCUITESSA-N
Data  11 IC50  3 EC50
  Tab Delimited (TSV)   2D SDfile   Computed 3D by Vconf -m prep SDfile
Find this compound or compounds like it in BindingDB:
Activity Spreadsheet -- Enzyme Inhibition Constant Data from BindingDB
Found 14 hits for monomerid = 33051
TargetBcl-2-related protein A1(Homo sapiens (Human))
Nmmlsc
Curated by PubChem BioAssay
LigandPNGBDBM33051((4-chlorodithiazol-5-ylidene)-(3,4,5-trimethoxyphe...)
Affinity DataEC50:  3.63E+3nMpH: 7.4 T: 2°C. Assay description: The multiplex is constructed by using beads for each protein target that have been labeled with varying intensities of red color, so that each assay ...
In DepthDetails PCBioAssay
TargetGag-Pol polyprotein(Human immunodeficiency virus type 1 group M subtyp...)
University Of Pittsburgh
Curated by PubChem BioAssay
LigandPNGBDBM33051((4-chlorodithiazol-5-ylidene)-(3,4,5-trimethoxyphe...)
Affinity DataIC50:  281nMpH: 8.0 T: 2°C. Assay description: A fluorescence resonance energy transfer assay is developed in 96-well and 384-well microplate formats with robotic manipulation to enable high-throu...
In DepthDetails PCBioAssay
TargetEukaryotic translation initiation factor 4 gamma 1(Homo sapiens (Human))
Emory University
Curated by PubChem BioAssay
LigandPNGBDBM33051((4-chlorodithiazol-5-ylidene)-(3,4,5-trimethoxyphe...)
Affinity DataIC50:  2.04E+4nM. Assay description: Dose Response Confirmation for Small Molecule Inhibitors of Eukaryotic Translation Initiation NIH Molecular Libraries Screening Centers Network [MLSC...
In DepthDetails PCBioAssay
TargetPhosphomannomutase 2(Homo sapiens (Human))
Burnham Center For Chemical Genomics
Curated by PubChem BioAssay
LigandPNGBDBM33051((4-chlorodithiazol-5-ylidene)-(3,4,5-trimethoxyphe...)
Affinity DataIC50: >1.00E+5nM. Assay description: Data Source: Sanford-Burnham Center for Chemical Genomics (SBCCG) Source Affiliation: Sanford-Burnham Medical Research Institute (SBMRI, San Diego, C...
In DepthDetails PCBioAssay
TargetMannose-6-phosphate isomerase(Homo sapiens (Human))
Burnham Center For Chemical Genomics
Curated by PubChem BioAssay
LigandPNGBDBM33051((4-chlorodithiazol-5-ylidene)-(3,4,5-trimethoxyphe...)
Affinity DataIC50:  2.91E+3nM. Assay description: Data Source: Sanford-Burnham Center for Chemical Genomics (SBCCG) Source Affiliation: Sanford-Burnham Medical Research Institute (SBMRI, San Diego, C...
In DepthDetails PCBioAssay
TargetMannose-6-phosphate isomerase(Homo sapiens (Human))
Burnham Center For Chemical Genomics
Curated by PubChem BioAssay
LigandPNGBDBM33051((4-chlorodithiazol-5-ylidene)-(3,4,5-trimethoxyphe...)
Affinity DataIC50:  4.76E+3nM. Assay description: Data Source: Sanford-Burnham Center for Chemical Genomics (SBCCG) Source Affiliation: Sanford-Burnham Medical Research Institute (SBMRI, San Diego, C...
In DepthDetails PCBioAssay
TargetLow molecular weight phosphotyrosine protein phosphatase(Homo sapiens (Human))
Burnham Center For Chemical Genomics
Curated by PubChem BioAssay
LigandPNGBDBM33051((4-chlorodithiazol-5-ylidene)-(3,4,5-trimethoxyphe...)
Affinity DataIC50: >8.00E+4nM
In DepthDetails PCBioAssay
TargetVoltage-dependent N-type calcium channel subunit alpha-1B(Homo sapiens (Human))
Burnham Center For Chemical Genomics
Curated by PubChem BioAssay
LigandPNGBDBM33051((4-chlorodithiazol-5-ylidene)-(3,4,5-trimethoxyphe...)
Affinity DataIC50:  1.08E+4nM. Assay description: Data Source: Data Source: Sanford-Burnham Center for Chemical Genomics (SBCCG) Source Affiliation: Sanford-Burnham Medical Research Institute Network...
In DepthDetails PCBioAssay
TargetDNA dC->dU-editing enzyme APOBEC-3G(Homo sapiens (Human))
Burnham Center For Chemical Genomics
Curated by PubChem BioAssay
LigandPNGBDBM33051((4-chlorodithiazol-5-ylidene)-(3,4,5-trimethoxyphe...)
Affinity DataIC50:  7.20E+3nMT: 2°C. Assay description: Data Source: Sanford-Burnham Center for Chemical Genomics (SBCCG) Source Affiliation: Sanford-Burnham Medical Research Institute (SBMRI, San Diego, C...
In DepthDetails PCBioAssay
TargetHexokinase HKDC1 [W721R](Homo sapiens (Human))
Burnham Center For Chemical Genomics
Curated by PubChem BioAssay
LigandPNGBDBM33051((4-chlorodithiazol-5-ylidene)-(3,4,5-trimethoxyphe...)
Affinity DataEC50:  5.69E+4nM. Assay description: Data Source: Sanford-Burnham Center for Chemical Genomics (SBCCG) Source Affiliation: Sanford-Burnham Medical Research Institute (SBMRI, San Diego, C...
In DepthDetails PCBioAssay
TargetDNA dC->dU-editing enzyme APOBEC-3A(Homo sapiens (Human))
Burnham Center For Chemical Genomics
Curated by PubChem BioAssay
LigandPNGBDBM33051((4-chlorodithiazol-5-ylidene)-(3,4,5-trimethoxyphe...)
Affinity DataIC50: >1.00E+5nMT: 2°C. Assay description: Data Source: Sanford-Burnham Center for Chemical Genomics (SBCCG) Source Affiliation: Sanford-Burnham Medical Research Institute (SBMRI, San Diego, C...
In DepthDetails PCBioAssay
TargetHexokinase-1(Homo sapiens (Human))
Burnham Center For Chemical Genomics
Curated by PubChem BioAssay
LigandPNGBDBM33051((4-chlorodithiazol-5-ylidene)-(3,4,5-trimethoxyphe...)
Affinity DataEC50:  5.53E+4nM. Assay description: Data Source: Sanford-Burnham Center for Chemical Genomics (SBCCG) Source Affiliation: Sanford-Burnham Medical Research Institute (SBMRI, San Diego, C...
In DepthDetails PCBioAssay
TargetLow molecular weight phosphotyrosine protein phosphatase(Homo sapiens (Human))
Burnham Center For Chemical Genomics
Curated by PubChem BioAssay
LigandPNGBDBM33051((4-chlorodithiazol-5-ylidene)-(3,4,5-trimethoxyphe...)
Affinity DataIC50: >8.00E+4nM
In DepthDetails PCBioAssay
TargetAmyloid-beta A4 precursor protein-binding family A member 1(Rattus norvegicus)
Burnham Center For Chemical Genomics
Curated by PubChem BioAssay
LigandPNGBDBM33051((4-chlorodithiazol-5-ylidene)-(3,4,5-trimethoxyphe...)
Affinity DataIC50:  5.22E+3nM. Assay description: Data Source: Sanford-Burnham Center for Chemical Genomics (SBCCG) Source Affiliation: Sanford-Burnham Medical Research Institute (SBMRI, San Diego, C...
In DepthDetails PCBioAssay