BDBM33148 (5E)-3-benzyl-5-[(5-methyl-2-furyl)methylene]hydantoin::(5E)-3-benzyl-5-[(5-methylfuran-2-yl)methylidene]imidazolidine-2,4-dione::(5E)-5-[(5-methyl-2-furanyl)methylidene]-3-(phenylmethyl)imidazolidine-2,4-dione::(5E)-5-[(5-methylfuran-2-yl)methylidene]-3-(phenylmethyl)imidazolidine-2,4-dione::3-benzyl-5-[(5-methyl-2-furyl)methylene]-2,4-imidazolidinedione::MLS000698643::SMR000228457::cid_846545
SMILES Cc1ccc(\C=C2\NC(=O)N(Cc3ccccc3)C2=O)o1
InChI Key InChIKey=RMADRUATHQHFPU-NTEUORMPSA-N
Data  1 EC50
  Tab Delimited (TSV)   2D SDfile   Computed 3D by Vconf -m prep SDfile
Find this compound or compounds like it in BindingDB:
Activity Spreadsheet -- Enzyme Inhibition Constant Data from BindingDB
Found 1 hit for monomerid = 33148
TargetBcl-2-related protein A1(Homo sapiens (Human))
Nmmlsc
Curated by PubChem BioAssay
LigandPNGBDBM33148((5E)-3-benzyl-5-[(5-methyl-2-furyl)methylene]hydan...)
Affinity DataEC50:  2.73E+3nMpH: 7.4 T: 2°C. Assay description: The multiplex is constructed by using beads for each protein target that have been labeled with varying intensities of red color, so that each assay ...
In DepthDetails PCBioAssay